{"text_format":"1","workbook":"xlsx","n_sheets":9,"sheets":["Local","Région","Donnees_Local","Donnees_RLS_OLD","Liste","Correspondance","Entete","Formulaire","Choix"],"not_rendered":{"charts":0,"images":76,"macros":1,"external_links":0,"defined_names":1,"comments":0,"pivot_tables":0},"unopened":[],"bounds":{"document_bytes":16777216,"sheet_cells":100000,"rows_first":2000,"rows_last":500,"rows_between":2000,"halvings":0,"cell_chars":16384,"cell_head_chars":4096},"cells_cut":0,"cells_raw":0,"read":"whole","date_system":"1900"}

{"sheet":"Local","index":0,"n_rows":438,"n_cols":15,"rows_kept":438,"cut":false,"hidden":false,"merged":[[326,1,326,2],[326,3,326,4],[326,5,326,6],[234,1,234,2],[234,5,234,6],[235,1,235,2],[235,3,235,4],[235,5,235,6],[234,7,235,7],[416,11,417,11],[416,12,417,13],[234,8,235,9],[234,10,235,10],[415,0,415,14],[325,1,325,2],[325,5,325,6],[325,7,326,7],[325,8,326,9],[325,10,326,10],[416,14,417,14],[417,1,417,2],[417,3,417,4],[417,5,417,6],[417,7,417,8],[417,9,417,10],[416,1,416,2],[416,3,416,4],[416,5,416,6],[416,7,416,8],[416,9,416,10]]}
["Proportion de la population ayant les conditions sociales les plus défavorables de la région des Laurentides selon ses RLS, 2016"]
[]
[]
[]
[]
[]
[]
[]
[]
[]
[]
[]
[]
[]
[]
[]
[]
[]
[]
[]
[]
[]
[]
[]
[]
[]
[]
[]
[]
[]
{"$rows_left_out":409}
{"sheet":"Région","index":1,"n_rows":0,"n_cols":0,"rows_kept":0,"cut":false,"hidden":false,"merged":[]}

{"sheet":"Donnees_Local","index":2,"n_rows":1218,"n_cols":29,"rows_kept":1218,"cut":false,"hidden":false,"merged":[[918,0,918,14],[919,1,919,2],[919,9,919,10],[919,11,920,11],[919,12,920,13],[919,14,920,14],[920,1,920,2],[920,3,920,4],[920,5,920,6],[920,7,920,8],[920,9,920,10],[903,0,903,14],[904,1,904,2],[904,9,904,10],[904,11,905,11],[904,12,905,13],[904,14,905,14],[905,1,905,2],[905,3,905,4],[905,5,905,6],[905,7,905,8],[905,9,905,10],[887,0,887,14],[888,1,888,2],[888,9,888,10],[888,11,890,11],[888,12,890,13],[888,14,890,14],[889,1,889,2],[889,3,889,4],[889,5,889,6],[889,7,889,8],[889,9,889,10],[890,1,890,2],[890,3,890,4],[890,5,890,6],[890,7,890,8],[890,9,890,10],[870,0,870,14],[871,1,871,2],[871,9,871,10],[871,11,872,11],[871,12,872,13],[871,14,872,14],[872,1,872,2],[872,3,872,4],[872,5,872,6],[872,7,872,8],[872,9,872,10],[856,0,856,14],[857,1,857,2],[857,9,857,10],[857,11,858,11],[857,12,858,13],[857,14,858,14],[858,1,858,2],[858,3,858,4],[858,5,858,6],[858,7,858,8],[858,9,858,10],[841,0,841,14],[842,1,842,2],[842,9,842,10],[842,11,844,11],[842,12,844,13],[842,14,844,14],[843,1,843,2],[843,3,843,4],[843,5,843,6],[843,7,843,8],[843,9,843,10],[844,1,844,2],[844,3,844,4],[844,5,844,6],[844,7,844,8],[844,9,844,10],[457,0,457,14],[458,1,458,2],[458,9,458,10],[458,11,459,11],[458,12,459,13],[458,14,459,14],[458,3,458,4],[458,5,458,6],[458,7,458,8],[459,1,459,2],[459,3,459,4],[459,5,459,6],[459,7,459,8],[459,9,459,10],[276,5,276,6],[276,7,277,7],[276,8,277,9],[276,10,277,10],[367,1,367,2],[367,5,367,6],[367,7,368,7],[367,8,368,9],[367,10,368,10],[368,1,368,2],[368,3,368,4],[368,5,368,6],[276,1,276,2],[277,1,277,2],[277,3,277,4],[277,5,277,6],[810,0,810,14],[811,1,811,2],[811,9,811,10],[811,11,812,11],[811,12,812,13],[811,14,812,14],[812,1,812,2],[812,3,812,4],[812,5,812,6],[812,7,812,8],[812,9,812,10],[764,9,764,10],[786,0,786,14],[787,1,787,2],[787,9,787,10],[787,11,788,11],[787,12,788,13],[787,14,788,14],[788,1,788,2],[788,3,788,4],[788,5,788,6],[788,7,788,8],[788,9,788,10],[93,0,93,14],[761,0,761,14],[762,1,762,2],[762,9,762,10],[762,11,764,11],[762,12,764,13],[762,14,764,14],[763,1,763,2],[763,3,763,4],[763,5,763,6],[763,7,763,8],[763,9,763,10],[764,1,764,2],[764,3,764,4],[764,5,764,6],[764,7,764,8],[94,14,95,14],[95,1,95,2],[95,3,95,4],[95,5,95,6],[95,7,95,8],[95,9,95,10],[94,1,94,2],[94,9,94,10],[1,0,1,14],[2,1,2,2],[2,9,2,10],[2,11,4,11],[2,12,4,13],[2,14,4,14],[3,1,3,2],[3,3,3,4],[3,5,3,6],[3,7,3,8],[3,9,3,10],[4,1,4,2],[4,3,4,4],[4,5,4,6],[4,7,4,8],[4,9,4,10],[94,11,95,11],[94,12,95,13],[184,0,184,14],[185,1,185,2],[185,9,185,10],[185,11,186,11],[185,12,186,13],[185,14,186,14],[186,1,186,2],[186,3,186,4],[186,5,186,6],[186,7,186,8],[186,9,186,10],[556,0,556,14],[557,1,557,2],[557,9,557,10],[557,11,558,11],[557,12,558,13],[557,14,558,14],[558,1,558,2],[558,3,558,4],[558,5,558,6],[558,7,558,8],[558,9,558,10],[655,0,655,14],[656,1,656,2],[656,9,656,10],[656,11,657,11],[656,12,657,13],[656,14,657,14],[657,1,657,2],[657,3,657,4],[657,5,657,6],[657,7,657,8],[657,9,657,10],[941,0,941,14],[942,1,942,2],[942,9,942,10],[942,11,944,11],[942,12,944,13],[942,14,944,14],[943,1,943,2],[943,3,943,4],[943,5,943,6],[943,7,943,8],[943,9,943,10],[944,1,944,2],[944,3,944,4],[944,5,944,6],[944,7,944,8],[944,9,944,10],[1035,0,1035,14],[1036,1,1036,2],[1036,9,1036,10],[1036,11,1037,11],[1036,12,1037,13],[1036,14,1037,14],[1037,1,1037,2],[1037,3,1037,4],[1037,5,1037,6],[1037,7,1037,8],[1037,9,1037,10],[1128,0,1128,14],[1129,1,1129,2],[1129,9,1129,10],[1129,11,1130,11],[1129,12,1130,13],[1129,14,1130,14],[1130,1,1130,2],[1130,3,1130,4],[1130,5,1130,6],[1130,7,1130,8],[1130,9,1130,10]]}
["Défavorisation combinée 2016 MRC ---- LOCAL ----"]
["Répartition de la population (N, %) par profil de défavorisation combinée 2016\nRégion des Laurentides (LOCAUX) 2016)"]
[null,"Conditions\nplus favorables",null,null,null,null,null,null,null,"Conditions\nplus défavorables",null,"Population\navec indice","Population\nsans indice",null,"Population\ntotale"]
[null,"Profil 1",null,"Profil 2",null,"Profil 3",null,"Profil 4",null,"Profil 5"]
[null,"matériellement \nET socialement \nplus favorables",null,"moyennes matériellement\nEt socialement",null,"socialement\nplus défavorables\n(pas matériellement)",null,"matériellement\nplus défavorables\n(pas socialement)",null,"matériellement\nET socialement\nplus défavorables"]
[null,"N","%","N","%","N","%","N","%","N","%","N   ","N","%","N"]
["MRC Deux-Montagnes",5100,5.2373814119676371E-2,53020,0.5443960737607294,15040,0.15438005667583884,15250,0.15659780689145344,8990,9.2252248552301949E-2,97400,810,8.2176715578953802E-3,98200]
["    Saint-Eustache",3660,8.4779891681710878E-2,23450,0.54279498217840116,6380,0.14759524140165717,2310,5.34185066888858E-2,7410,0.171411378049345,43210,800,1.8223959280130885E-2,44010]
["    Deux-Montagnes",1440,8.2190214906264283E-2,7670,0.43832876085962508,6440,0.36808413351623226,1950,0.11139689071787837,0,0,17500,0,0,17500]
["    Sainte-Marthe-sur-le-Lac",0,0,12380,0.68512780790085204,1220,6.7444948544871083E-2,4470,0.24742724355427687,0,0,18070,0,0,18070]
["    Pointe-Calumet",0,0,0,0,1000,0.15556938394523959,3850,0.59878655880522713,1580,0.24564405724953328,6430,0,0,6430]
["    Saint-Joseph-du-Lac",0,0,5670,0.84731568715417971,0,0,1020,0.15268431284582024,0,0,6690,0,0,6690]
["    Oka",0,0,3190,0.83477350091647029,0,0,630,0.16522649908352971,0,0,3820,10,{"$f":"M13/O13","v":2.617801047120419E-3},3820]
["    Saint-Placide",0,0,660,0.39383155397390274,0,0,1020,0.60616844602609732,0,0,1690,0,0,1690]
["MRC Thérèse-De Blainville",12910,8.6502175122497263E-2,75610,0.50680689336202212,23490,0.15745339741398379,24090,0.16150200754757452,13090,8.7735526553922263E-2,149190,7920,5.0387325512561823E-2,157100]
["    Boisbriand",0,0,15070,0.56048207112036896,4040,0.15008927242969797,4950,0.18419877994346079,2830,0.10522987650647225,26880,0,0,26880]
["    Sainte-Thérèse",0,0,6650,0.29575585016460537,7010,0.31163804608950973,850,3.7903728089687692E-2,7970,0.35470237565619717,22480,3510,0.13509561737658241,25990]
["    Blainville",7730,0.14149923994066044,34010,0.62295562352337874,4730,8.6591820662625232E-2,6260,0.11466822951960587,1870,3.4285086353729788E-2,54600,2260,3.9779821676661449E-2,56860]
["    Rosemère",3050,0.22742524793080307,7930,0.59130564462008794,2430,0.18126910744910893,0,0,0,0,13410,550,3.9188995558102881E-2,13960]
["    Lorraine",2130,0.22765183917878529,7220,0.77234816082121471,0,0,0,0,0,0,9350,0,0,9350]
["    Bois-des-Filion",0,0,2490,0.26743188157047842,4330,0.46481441750697278,2080,0.22323535721948079,420,4.4518343703068008E-2,9320,310,3.2586135325861354E-2,9640]
["    Sainte-Anne-des-Plaines",0,0,2230,0.16995205114544487,960,7.2912702640992463E-2,9950,0.75713524621356265,0,0,13140,1280,8.8898134664725056E-2,14420]
["Mirabel",4570,9.0392572209134284E-2,26360,0.52192504899728787,7330,0.14509136261952368,7600,0.1504959119434601,4650,9.209510423059411E-2,50510,0,0,50510]
["    Mirabel",4570,9.0392572209134284E-2,26360,0.52192504899728787,7330,0.14509136261952368,7600,0.1504959119434601,4650,9.209510423059411E-2,50510,0,0,50510]
["MRC la Rivière-du-Nord",6270,5.1662340872574465E-2,70630,0.58192230049849625,15000,0.12357763770444527,14430,0.11889754047707329,15040,0.1239401804474107,121370,6810,5.309354763205118E-2,128170]
["    Saint-Colomban",0,0,15620,0.97521692989574882,0,0,400,2.4783070104251202E-2,0,0,16020,0,0,16020]
["    Saint-Jérôme",3490,5.1716735020209945E-2,27920,0.41336373462045278,12820,0.189736604432863,8270,0.12247375668112702,15040,0.22270916924534728,67540,6810,9.1531487907890133E-2,74350]
["    Sainte-Sophie",0,0,11200,0.71389420012746974,0,0,4490,0.28610579987253026,0,0,15690,0,0,15690]
["    Prévost",2780,0.21358252576526687,7360,0.56591293647131213,2180,0.16789724657744962,680,5.2607291185971392E-2,0,0,13000,0,0,13000]
["    Saint-Hippolyte",0,0,8530,0.93547679139690554,0,0,590,6.4523208603094476E-2,0,0,9110,0,0,9110]
{"$rows_left_out":1189}
{"sheet":"Donnees_RLS_OLD","index":3,"n_rows":274,"n_cols":15,"rows_kept":274,"cut":false,"hidden":false,"merged":[[3,1,3,2],[3,9,3,10],[3,11,5,11],[3,12,5,13],[3,14,5,14],[4,1,4,2],[4,3,4,4],[4,5,4,6],[4,7,4,8],[2,0,2,14],[94,0,94,14],[95,1,95,2],[95,9,95,10],[95,11,96,11],[95,12,96,13],[95,14,96,14],[96,1,96,2],[96,3,96,4],[96,5,96,6],[4,9,4,10],[5,1,5,2],[5,3,5,4],[5,5,5,6],[5,7,5,8],[5,9,5,10],[187,5,187,6],[187,7,187,8],[187,9,187,10],[96,7,96,8],[96,9,96,10],[185,0,185,14],[186,1,186,2],[186,9,186,10],[186,11,187,11],[186,12,187,13],[186,14,187,14],[187,1,187,2],[187,3,187,4]]}
["Défavorisation combinée 2016 RLS"]
[]
["Répartition de la population (N, %) par profil de défavorisation combinée 2016\nRégion des Laurentides (variation régionale 2016)"]
[null,"Conditions\nplus favorables",null,null,null,null,null,null,null,"Conditions\nplus défavorables",null,"Population\navec indice","Population\nsans indice",null,"Population\ntotale"]
[null,"Profil 1",null,"Profil 2",null,"Profil 3",null,"Profil 4",null,"Profil 5"]
[null,"matériellement \nET socialement \nplus favorables",null,"moyennes matériellement\nEt socialement",null,"socialement\nplus défavorables\n(pas matériellement)",null,"matériellement\nplus défavorables\n(pas socialement)",null,"matériellement\nET socialement\nplus défavorables"]
[null,"N","%","N","%","N","%","N","%","N","%","N","N","%","N"]
["1511 - RLS d'Antoine-Labelle",0,0,2490,7.6968345412872452,540,1.6663569348943814,23710,73.440500526544014,5550,17.19630799727436,32290,2960,8.390318644837274,35240]
["    Notre-Dame-du-Laus",0,0,0,0,0,0,1560,100,0,0,1560,0,0,1560]
["    Notre-Dame-de-Pontmain",0,0,0,0,0,0,780,100,0,0,780,0,0,780]
["    Lac-du-Cerf",0,0,0,0,0,0,440,100,0,0,440,0,0,440]
["    Saint-Aimé-du-lac-des-îles",0,0,0,0,0,0,790,100,0,0,790,0,0,790]
["    Kiamika",0,0,0,0,0,0,760,100,0,0,760,0,0,760]
["    Nominingue",0,0,610,28.685072531586336,0,0,1520,71.314927468413671,0,0,2140,0,0,2140]
["    Rivière-Rouge",0,0,720,16.728366496992134,0,0,2360,54.673762147154093,1240,28.597871355853773,4320,0,0,4320]
["    La Macaza",0,0,0,0,0,0,0,0,440,100,440,710,61.826086956521742,1150]
["    L'Ascension",0,0,0,0,0,0,790,100,0,0,790,0,0,790]
["    Lac-Saguay",0,0,0,0,0,0,460,100,0,0,460,0,0,460]
["    Chute-Saint-Philippe",0,0,0,0,0,0,940,100,0,0,940,0,0,940]
["    Lac-des-Écorces",0,0,690,25.164594001463058,0,0,1600,58.37600585223116,450,16.459400146305782,2730,0,0,2730]
["    Mont-Laurier",0,0,460,3.8821052631578952,540,4.5305263157894737,7450,62.728421052631575,3430,28.858947368421049,11880,2240,15.875602153584584,14120]
["    Ferme-Neuve",0,0,0,0,0,0,2710,100,0,0,2710,0,0,2710]
["    Lac-Saint-Paul",0,0,0,0,0,0,480,100,0,0,480,0,0,480]
["   Mont-Saint-Michel",0,0,0,0,0,0,500,100,0,0,500,0,0,500]
["   Sainte-Anne-du-Lac",0,0,0,0,0,0,580,100,0,0,580,0,100,580]
["   Territoires non organisés",0,0,0,0,0,0,0,0,0,0,0,10,0,10]
["1512 - RLS des Laurentides",550,1.2873134328358209,9300,21.686100746268657,7370,17.175839552238806,13470,31.401585820895523,12200,28.449160447761194,42880,3020,6.5835911289268436,45900]
["    Val-Morin",0,0,880,30.73170731707317,630,22.05574912891986,0,0,1360,47.21254355400697,2870,0,0,2870]
["    Val-David",0,0,930,18.954647142566607,2870,58.389261744966447,0,0,1110,22.65609111246695,4920,0,0,4920]
["    Lanthier",0,0,0,0,0,0,830,100,0,0,830,0,0,830]
{"$rows_left_out":245}
{"sheet":"Liste","index":4,"n_rows":53,"n_cols":6,"rows_kept":53,"cut":false,"hidden":false,"merged":[]}
[null,null,null,"Matérielle et sociale"]
[null,null,null,"Matérielle"]
[null,null,null,"Sociale"]
[720,"MRC  Deux-Montagnes","Local"]
[730,"MRC Thérèse-De Blainville","Local"]
[740,"Mirabel","Local"]
[750,"MRC la Rivière-du-Nord","Local"]
[760,"MRC Argenteuil","Local"]
[770,"MRC Les Pays-d'en-Haut","Local"]
[780,"MRC Les Laurentides","Local"]
[790,"MRC Antoine-Labelle","Local"]
[]
[]
[]
[]
[]
[]
[]
[]
[]
[]
[]
[{"$error":"#N/A"},"Région selon RLS","Regional"]
[15992,"Région selon MRC","Régional"]
[15993,"Liste des RLS et leurs régions","Régional"]
[720,"MRC Deux-Montagnes","Régional"]
[1515,"RLS de Deux-Montagnes - Mirabel-Sud","Régional"]
["730-1517","MRC/RLS Thérèse-De Blainville","Régional"]
[740,"Mirabel","Régional"]
[750,"MRC la Rivière-du-Nord","Régional"]
{"$rows_left_out":24}
{"sheet":"Correspondance","index":5,"n_rows":91,"n_cols":34,"rows_kept":91,"cut":false,"hidden":false,"merged":[]}
["Id Territoire","Concanetation","Territoire","Type défavo","Plage Total","Plage en-tête","Plage Q5","Plage Q5 en-tête","Plage Q5 Territoire","PNG Carte","Nom carte","Endroit Copie Tableau","Endroit Copie en-tête","Endroit Copie Tableau Q5","Endroit Copie Q5 en-tête","Endroit Copie Tableau Territoire Q5","Texte carte","Texte tableau","Texte 2011","Endroit texte carte","Endroit texte tableau","Titre","Source","Endroit Source","Hauteur Ligne 4","Titre Q5","Source DSP","Endroit Source DSP","Note Pop sans indice","Endroit Note Pop sans indice","Lien vers Cartes 2011","Plage Tableau à copier","Plage Tableau Q5 à copier","Titre carte"]
[]
[]
[]
[]
[]
[]
[]
[]
[]
[]
[]
[]
[]
[]
[]
[]
[]
[]
[]
[]
[]
[]
[]
[]
[]
[]
[]
[720,{"$f":"A29&D29&C29","v":"720Matérielle et socialeLocal"},"Local","Matérielle et sociale","A7:O14","A1:N4","J7:K14","A12:B15","A7:A14","MRC_DeuxMontagnes_Defavo_2016_Comb.png","MRC_DM_2016_Comb","A6","B2","B6","B2","A6","Les secteurs parmi les plus défavorisés de la MRC de Deux-Montagnes à la fois sur les plans matériel et social (violet - profil 5) sont répartis dans deux municipalités, soit Saint-Eustache et Pointe-Calumet.\n\nSaint-Eustache et Deux-Montagnes sont les deux municipalités qui présentent le plus grand nombre de personnes vivant dans des secteurs ayant un profil socialement plus défavorable seulement (bleu - profil 3). On observe également des secteurs avec ce profil dans Sainte-Marthe-sur-le-Lac et Pointe-Calumet.\n\nOn retrouve des secteurs qui présentent un profil matériellement plus défavorable seulement (jaune- profil 4) dans toutes les municipalités de la MRC de Deux-Montagnes. Les municipalités Pointe-Calumet et Saint-Placide sont celles dont la plus grande partie de leur population vit dans des secteurs ayant ce profil. \n\nMise à jour : septembre 2019\nPanorama de la défavorisation dans les Laurentides 2016, produit par l’équipe Surveillance, recherche et évaluation (SRÉ), Direction de santé publique des Laurentides.","Dans la MRC de Deux-Montagnes, les secteurs ayant des conditions parmi les plus défavorables de la MRC à la fois sur le plan matériel et social (profil 5) sont localisés à Saint-Eustache et Pointe-Calumet. À Pointe-Calumet, près du quart de la population habite ce secteur.\n\nLes secteurs où les conditions sont parmi les plus défavorables de la MRC seulement sur le plan social (profil 3) se retrouvent à Saint-Eustache, Deux-Montagnes, Sainte-Marthe-sur-le-Lac et Pointe-Calumet. Environ le tiers de la population de Deux-Montagnes habite dans ces secteurs.\n\nOn retrouve des secteurs qui présentent les conditions parmi les plus défavorables de la MRC seulement sur le plan matériel (profil 4) dans toutes les municipalités du territoire. Environ 60 % de la population de Pointe-Calumet et de Saint-Placide résident dans ces secteurs.\n\nMise à jour : septembre 2019","Analyse 2011-2016 non disponible","J3:O40","A19:K34","Répartition de la population selon les profils de défavorisation matérielle et sociale combinée 2016 de la MRC de Deux-Montagnes","Source : INSPQ et BIESP, 2018. Statistique Canada, Recensement 2016.","A14","49.5","Population des secteurs ayant les conditions matérielles et sociales les plus défavorables de la MRC de Deux-Montagnes, 2016","Panorama de la défavorisation dans les Laurentides 2016, produit par l’équipe Surveillance, recherche et évaluation, Direction de santé publique des Laurentides, Centre intégré de santé et de services sociaux des Laurentides","A15","La population sans indice réside dans des secteurs où l’information pour le calcul de l’indice est indisponible à cause des ménages collectifs (centres d’hébergement, pénitenciers) ou du taux de non-réponse trop élevé.","A16","Non disponible","A1:O16","A1:O14","Répartition de la population selon les profils de défavorisation matérielle et sociale combinée 2016 de la MRC de Deux-Montagnes"]
[720,"720MatérielleLocal","Local","Matérielle","A280:K287","A23:J25","F280:G287","A28:B30","A280:A287","MRC_DeuxMontagnes_Defavo_2016_Mat.png","MRC_DM_2016_Mat","A5","B2","B5","B2","A5","Les secteurs les plus défavorisés de la MRC de Deux-Montagnes (quartile 4) sur le plan matériel sont répartis dans toutes les municipalités du territoire.\n\nPointe-Calumet et Saint-Placide sont les deux municipalités présentant les proportions les plus élevées de leur population résidant dans des secteurs du quartile le plus défavorisé matériellement.\n\nLe plus grand nombre de personnes vivant dans des secteurs parmi les plus défavorisés de la MRC se trouve à Saint-Eustache, la municipalité la plus populeuse de la MRC.\n\nMise à jour : septembre 2019\nPanorama de la défavorisation dans les Laurentides 2016, produit par l’équipe Surveillance, recherche et évaluation (SRÉ), Direction de santé publique des Laurentides.","Dans la MRC de Deux-Montagnes, on retrouve des secteurs ayant les conditions matérielles parmi les plus défavorables (quartile 4) de la MRC dans toutes les municipalités. \n\nPlus de 80 % de la population de Pointe-Calumet et 60 % de celle de Saint-Placide habitent ces secteurs.\n\nMise à jour : septembre 2019","Analyse 2011-2016 non disponible","J3:O40","A17:K32","Répartition de la population selon le niveau de défavorisation matérielle 2016 de la MRC de Deux-Montagnes","Source : INSPQ et BIESP, 2018. Statistique Canada, Recensement 2016.","A13","16.5","Population des secteurs ayant les conditions matérielles les plus défavorables de la MRC de Deux-Montagnes, 2016","Panorama de la défavorisation dans les Laurentides 2016, produit par l’équipe Surveillance, recherche et évaluation, Direction de santé publique des Laurentides, Centre intégré de santé et de services sociaux des Laurentides","A14","La population sans indice réside dans des secteurs où l’information pour le calcul de l’indice est indisponible à cause des ménages collectifs (centres d’hébergement, pénitenciers) ou du taux de non-réponse trop élevé.","A15","Non disponible","A1:O15","A1:O13","Répartition de la population selon le niveau de défavorisation matérielle 2016 de la MRC de Deux-Montagnes"]
{"$rows_left_out":62}
{"sheet":"Entete","index":6,"n_rows":30,"n_cols":14,"rows_kept":30,"cut":false,"hidden":false,"merged":[[27,0,27,1],[28,0,28,1],[22,0,22,1],[22,4,22,5],[22,6,23,6],[22,7,23,8],[22,9,23,9],[23,0,23,1],[23,2,23,3],[23,4,23,5],[2,11,2,12],[11,0,11,1],[17,0,17,1],[1,0,2,1],[1,2,2,3],[1,4,2,5],[1,6,2,7],[1,8,2,9],[12,0,13,1],[18,0,18,1],[6,10,7,10],[6,11,7,12],[6,13,7,13],[7,0,7,1],[7,2,7,3],[7,4,7,5],[7,6,7,7],[7,8,7,9],[6,0,6,1],[6,8,6,9],[0,0,0,1],[0,2,0,3],[0,4,0,5],[0,6,0,7],[0,8,0,9]]}
["Profil 1",null,"Profil 2",null,"Profil 3",null,"Profil 4",null,"Profil 5"]
["Conditions matériellement \nET socialement \nplus favorables",null,"Conditions moyennes matériellement\nEt socialement",null,"Conditions socialement\nplus défavorables\n(pas matériellement)",null,"Conditions matériellement\nplus défavorables\n(pas socialement)",null,"Conditions matériellement\nET socialement\nplus défavorables"]
[null,null,null,null,null,null,null,null,null,null,"Population\navec indice","Population\nsans indice",null,"Population\ntotale"]
["N","%","N","%","N","%","N","%","N","%","N","N","%","N"]
[]
[]
["Conditions\nplus favorables",null,null,null,null,null,null,null,"Conditions\nplus défavorables",null,"Population avec indice","Population\nsans indice",null,"Population totale"]
["Quintile 1",null,"Quintile 2",null,"Quintile 3",null,"Quintile 4",null,"Quintile 5"]
["N","%","N","%","N","%","N","%","N","%","N","N","%","N"]
[]
[]
["Profil 5"]
["Conditions matériellement\nET socialement\nplus défavorables"]
[]
["N","%"]
[]
[]
["Conditions\nplus défavorables"]
["Quintile 5"]
["N","%"]
[]
[]
["Conditions\nplus favorables",null,null,null,"Conditions\nplus défavorables",null,"Population avec indice","Population\nsans indice",null,"Population totale"]
["Quartile 1",null,"Quartiles 2-3",null,"Quartile 4"]
["N","%","N","%","N","%","N","N","%","N"]
[]
[]
["Conditions\nplus défavorables"]
["Quartile 4"]
["N","%"]
{"$rows_left_out":1}
{"sheet":"Formulaire","index":7,"n_rows":16,"n_cols":19,"rows_kept":16,"cut":false,"hidden":false,"merged":[]}
[null,null,null,null,null,null,null,null,null,null,null,null,null,null,null,null,null,null,"Dernière version : 10 février 2020"]
[]
[]
[]
[]
["  Panorama de la défavorisation comprend une gamme d’outils sur l’indice de défavorisation dans la région des Laurentides et ses territoires. On retrouve des outils qui servent à :"]
["·         localiser les populations les plus défavorisées "]
["·         quantifier l’importance de la défavorisation dans des secteurs"]
["·         caractériser le profil de défavorisation des populations."]
[]
[]
[]
[]
[]
[null,"  Avez-vous l'intérêt sur la population…",null,null,null,"  Choisissez le territoire désiré…",null,null,null,null,"  Voulez-vous observer la défavorisation "]
[null,null,null,null,null,null,null,null,null,null,"  selon sa dimension…"]

{"sheet":"Choix","index":8,"n_rows":33,"n_cols":4,"rows_kept":33,"cut":false,"hidden":false,"merged":[]}
[null,null,"","Régional"]
[]
[]
[null,{"$f":"B1&C1&D1","v":"Régional"}]
["Plage totale",{"$f":"VLOOKUP(B$4,Correspondance!B$2:AZ$100,4,FALSE)","v":{"$error":"#N/A"}}]
["Plage Q5",{"$f":"VLOOKUP(B$4,Correspondance!B$2:AZ$100,6,FALSE)","v":{"$error":"#N/A"}}]
["Plage en tête totale",{"$f":"VLOOKUP(B$4,Correspondance!B$2:AZ$100,5,FALSE)","v":{"$error":"#N/A"}}]
["Plage en tête Q5",{"$f":"VLOOKUP(B$4,Correspondance!B$2:AZ$100,7,FALSE)","v":{"$error":"#N/A"}}]
["Plage Q5 Territoire",{"$f":"VLOOKUP(B$4,Correspondance!B$2:AZ$100,8,FALSE)","v":{"$error":"#N/A"}}]
["Carte",{"$f":"VLOOKUP(B$4,Correspondance!B$2:AZ$100,10,FALSE)","v":{"$error":"#N/A"}}]
["Endroit Copie Tableau",{"$f":"VLOOKUP(B$4,Correspondance!B$2:AZ$100,11,FALSE)","v":{"$error":"#N/A"}}]
["Endroit Copie en-tête",{"$f":"VLOOKUP(B$4,Correspondance!B$2:AZ$100,12,FALSE)","v":{"$error":"#N/A"}}]
["Endroit Copie Tableau Q5",{"$f":"VLOOKUP(B$4,Correspondance!B$2:AZ$100,13,FALSE)","v":{"$error":"#N/A"}}]
["Endroit Copie Q5 en-tête",{"$f":"VLOOKUP(B$4,Correspondance!B$2:AZ$100,14,FALSE)","v":{"$error":"#N/A"}}]
["Endroit Copie Tableau Territoire Q5",{"$f":"VLOOKUP(B$4,Correspondance!B$2:AZ$100,15,FALSE)","v":{"$error":"#N/A"}}]
["Texte carte",{"$f":"VLOOKUP(B$4,Correspondance!B$2:AZ$100,16,FALSE)","v":{"$error":"#N/A"}}]
["Texte tableau",{"$f":"VLOOKUP(B$4,Correspondance!B$2:AZ$100,17,FALSE)","v":{"$error":"#N/A"}}]
["Texte 2011",{"$f":"VLOOKUP(B$4,Correspondance!B$2:AZ$100,18,FALSE)","v":{"$error":"#N/A"}}]
["Endroit texte carte",{"$f":"VLOOKUP(B$4,Correspondance!B$2:AZ$100,19,FALSE)","v":{"$error":"#N/A"}}]
["Endroit texte tableau",{"$f":"VLOOKUP(B$4,Correspondance!B$2:AZ$100,20,FALSE)","v":{"$error":"#N/A"}}]
["Titre",{"$f":"VLOOKUP(B$4,Correspondance!B$2:AZ$100,21,FALSE)","v":{"$error":"#N/A"}}]
["Source",{"$f":"VLOOKUP(B$4,Correspondance!B$2:AZ$100,22,FALSE)","v":{"$error":"#N/A"}}]
["Endroit Source",{"$f":"VLOOKUP(B$4,Correspondance!B$2:AZ$100,23,FALSE)","v":{"$error":"#N/A"}}]
["Hauteur Ligne 4",{"$f":"VLOOKUP(B$4,Correspondance!B$2:AZ$100,24,FALSE)","v":{"$error":"#N/A"}}]
["Titre Q5",{"$f":"VLOOKUP(B$4,Correspondance!B$2:AZ$100,25,FALSE)","v":{"$error":"#N/A"}}]
["Source DSP",{"$f":"VLOOKUP(B$4,Correspondance!B$2:AZ$100,26,FALSE)","v":{"$error":"#N/A"}}]
["Endroit Source DSP",{"$f":"VLOOKUP(B$4,Correspondance!B$2:AZ$100,27,FALSE)","v":{"$error":"#N/A"}}]
["Note Pop sans indice",{"$f":"VLOOKUP(B$4,Correspondance!B$2:AZ$100,28,FALSE)","v":{"$error":"#N/A"}}]
["Endroit Note Pop sans indice",{"$f":"VLOOKUP(B$4,Correspondance!B$2:AZ$100,29,FALSE)","v":{"$error":"#N/A"}}]
["Lien vers Cartes 2011",{"$f":"VLOOKUP(B$4,Correspondance!B$2:AZ$100,30,FALSE)","v":{"$error":"#N/A"}}]
{"$rows_left_out":3}