{"text_format":"1","workbook":"xlsx","n_sheets":9,"sheets":["Local","Région","Donnees_Local","Donnees_RLS_OLD","Liste","Correspondance","Entete","Formulaire","Choix"],"not_rendered":{"charts":0,"images":82,"macros":1,"external_links":0,"defined_names":1,"comments":0,"pivot_tables":0},"unopened":[],"bounds":{"document_bytes":16777216,"sheet_cells":100000,"rows_first":2000,"rows_last":500,"rows_between":2000,"halvings":0,"cell_chars":16384,"cell_head_chars":4096},"cells_cut":0,"cells_raw":0,"read":"whole","date_system":"1900"}

{"sheet":"Local","index":0,"n_rows":438,"n_cols":15,"rows_kept":438,"cut":false,"hidden":false,"merged":[[3,12,3,13],[416,12,417,13],[234,7,235,7],[326,1,326,2],[326,3,326,4],[326,5,326,6],[416,3,416,4],[416,5,416,6],[416,7,416,8],[416,1,416,2],[234,1,234,2],[234,5,234,6],[235,1,235,2],[235,3,235,4],[235,5,235,6],[416,14,417,14],[417,9,417,10],[234,8,235,9],[234,10,235,10],[415,0,415,14],[325,1,325,2],[325,5,325,6],[325,7,326,7],[325,8,326,9],[325,10,326,10],[417,1,417,2],[417,3,417,4],[417,5,417,6],[417,7,417,8],[416,11,417,11],[416,9,416,10],[1,9,1,10],[2,3,3,4],[2,5,3,6],[2,7,3,8],[1,1,1,2],[1,5,1,6],[2,1,3,2],[1,3,1,4],[1,7,1,8],[2,9,3,10]]}
["Répartition de la population selon les profils de défavorisation matérielle et sociale combinée 2021 de la région des Laurentides selon ses RLS et ses municipalités"]
[null,"Profil 1",null,"Profil 2",null,"Profil 3",null,"Profil 4",null,"Profil 5"]
[null,"Conditions matériellement \nET socialement \nplus favorables",null,"Conditions moyennes matériellement\nEt socialement",null,"Conditions socialement\nplus défavorables\n(pas matériellement)",null,"Conditions matériellement\nplus défavorables\n(pas socialement)",null,"Conditions matériellement\nET socialement\nplus défavorables"]
[null,null,null,null,null,null,null,null,null,null,null,"Population\navec indice","Population\nsans indice",null,"Population\ntotale"]
[null,"N","%","N","%","N","%","N","%","N","%","N","N","%","N"]
["Région des Laurentides",101800,0.16003772991667978,123800,0.19462348687313316,142900,0.22465021223078133,141000,0.22166326049363308,105100,0.16522559346014778,614600,21400,3.3642509039459208E-2,636100]
["RLS de Deux-Montagnes - Mirabel-Sud",22100,0.21121538711837839,31900,0.25159454344109122,25900,0.19311636116141739,26100,0.17386584715194786,13500,0.14874957729679816,119400,2600,2.1458283830367086E-2,122100]
["    Deux-Montagnes",3000,0.15662852358358917,4300,0.18816634105498189,7100,0.14496232207647222,1500,0.1574099916271281,1100,0.301255930784259,17000,900,5.1576890873569627E-2,17900]
["    Mirabel",0,0.17211061061914468,9000,0.16497552074085367,6400,0.30201861944788899,3700,0.32109279537083457,800,3.9802453821278082E-2,20000,0,0,20000]
["    Oka",1800,0.15650201612903225,1100,0.7036290322580645,500,0,500,0.13734879032258066,0,0,4000,0,2.5201612903225806E-3,4000]
["    Pointe-Calumet",0,8.6451202037892069E-2,0,0.43798758159528739,500,0,3300,0.25680624104441968,2500,0.2187549753224009,6300,0,0,6300]
["    Sainte-Marthe-sur-le-Lac",6500,6.2332676668182048E-2,7100,0.36409557003586401,2300,0.41046623225741269,3000,0.1631055210385412,900,0,19800,0,0,19800]
["    Saint-Eustache",9300,0.30795564979238449,8800,0.19188974291015107,7400,0.11787702093824542,9800,0.11120682039049386,8200,0.2338545807933563,43600,1700,3.721618517536885E-2,45300]
["    Saint-Joseph-du-Lac",1500,0.45370502062295548,700,0.22173232826056041,1600,0.10311477741430806,3200,0.22144787370217606,0,0,7000,0,0,7000]
["    Saint-Placide",0,0,700,0.58239910313901344,0,0.4176008968609865,1000,0,0,0,1800,0,0,1800]
["RLS Thérèse-De Blainville",51900,0.31697956389948179,21500,0.13156350836022293,41300,0.25229783905348585,21500,0.13164906619732081,17500,0.10717341351324924,153800,9900,6.033660897623936E-2,163600]
["    Blainville",22800,0.38109965061268158,11000,0.18398836490078402,13800,0.23057891305438072,4900,8.248215449940656E-2,2600,4.2695464651699294E-2,55100,4700,7.9155452281047825E-2,59800]
["    Boisbriand",6200,0.21845414723753001,2700,9.4708209693372888E-2,7600,0.26812208562950401,7300,0.25717111770524231,4600,0.16154443973435073,28300,0,0,28300]
["    Bois-des-Filion",500,5.0300226400236243E-2,1700,0.16438625849000885,5300,0.52170489221380056,1700,0.17147357023329068,600,5.856875676739836E-2,9800,300,3.3566295895265282E-2,10200]
["    Lorraine",8700,0.91286045043148822,400,4.3990738791833295E-2,400,4.3148810776678592E-2,0,0,0,0,9500,0,0,9500]
["    Rosemère",9300,0.65833924769339958,1600,0.11156848828956707,3200,0.23009226401703337,0,0,0,0,14100,0,0,14100]
["    Sainte-Anne-des-Plaines",800,5.203337494251363E-2,1800,0.1162210104460942,0,0,7200,0.47572432823073385,3800,0.25037776755797908,13600,1600,0.10564351882267919,15200]
["    Sainte-Thérèse",3600,0.13696151961708061,2400,9.0905664644028189E-2,10900,0.41265593788866695,300,1.3002675913013982E-2,6000,0.22628424980213319,23300,3200,0.12018995213507708,26500]
["RLS de la Rivière-du-Nord - Mirabel-Nord",18600,0.16940872652123226,42200,0.17250627437330246,43600,0.20475156630898814,38400,0.21637938814619007,35800,0.22120265276358497,178600,2900,1.5751391886702104E-2,181500]
["    Mirabel",5700,5.9402713740730702E-2,15900,0.17199768723488465,9700,0.38743121283727183,3800,0.26681451342086582,5900,0.11435387276624694,41100,0,0,41100]
["    Prévost",4500,0.41221151037101955,1500,0.22056675430908559,4300,0,2600,0.19872918492550398,700,0.16849255039439087,13700,0,0,13700]
["    Saint-Colomban",4900,0.60790544199070629,6700,0.2566162338648923,0,0.13547832414440142,6200,0,0,0,17700,0,0,17700]
["    Sainte-Sophie",0,0.17505530973451328,3200,0.26332964601769909,0,0.48949115044247793,13600,7.212389380530973E-2,1300,0,18100,0,0,18100]
["    Saint-Hippolyte",1300,0.12287937013778234,3000,0.28400037491798669,1700,0.35589089886587311,3900,0.23722935607835788,800,0,10700,0,0,10700]
["    Saint-Jérôme",2200,9.2254372732599454E-2,11900,0.11065538005061523,27800,7.7119668881602738E-2,8300,0.27115305499108622,27100,0.4131749217707853,77400,2900,3.5642601573311061E-2,80200]
["RLS Argenteuil",1100,3.2504933309665418E-2,4800,0.13800000000000001,700,1.9E-2,12000,0.34600000000000003,14700,0.42200000000000004,33300,1500,4.2999999999999997E-2,34700]
["    Brownsburg-Chatham",0,0,1900,0.26065958327583827,700,9.2590037256795904E-2,2000,0.26976680005519527,2700,0.37698357941217053,7200,0,0,7200]
["    Gore",1100,0.49571290132299661,0,0,0,0,1100,0.5042870986770035,0,0,2300,0,0,2300]
["    Grenville",0,0,0,0,0,0,0,0,1800,1,1800,0,0,1800]
["    Grenville-sur-la-Rouge",0,0,0,0,0,0,2300,0.80298300381546994,600,0.19701699618452997,2900,0,0,2900]
["    Harrington",0,0,0,0,0,0,1000,1,0,0,1000,0,0,1000]
["    Lachute",0,0,800,5.3191489361702128E-2,0,0,2300,0.16546099290780142,9500,0.67617021276595746,12600,1500,0.105177304964539,14100]
["    Mille-Isles",0,0,900,0.50552004648460203,0,0,900,0.49447995351539803,0,0,1700,0,0,1700]
["    Saint-André-d'Argenteuil",0,0,600,0.20176875204716674,0,0,2400,0.79823124795283329,0,0,3100,0,0,3100]
["    Wentworth",0,0,700,1,0,0,0,0,0,0,700,0,0,700]
["RLS Les Pays-d'en-Haut",4600,9.8217712019784256E-2,12700,0.27132989383021361,21800,0.46392785571142281,3900,8.3912505862789408E-2,3900,8.2398840233658802E-2,46900,0,2.1319234213107061E-4,46900]
["    Estérel",300,1,0,0,0,0,0,0,0,0,300,0,0,300]
["    Lac-des-Seize-îles",200,1,0,0,0,0,0,0,0,0,200,0,0,200]
["    Morin-Heights",1100,0.22851646002565201,2700,0.57994869602394183,900,0.19153484395040615,0,0,0,0,4700,0,0,4700]
["    Piedmont",0,0,800,0.23388952819332565,2700,0.76611047180667446,0,0,0,0,3500,0,0,3500]
["    Saint-Adolphe-d'Howard",0,0,700,0.1932531380753138,800,0.21548117154811716,1400,0.36532426778242683,900,0.22594142259414227,3800,0,0,3800]
["    Sainte-Adèle",1100,8.0085653104925048E-2,2200,0.15902926481084939,9600,0.68386866523911494,0,0,1100,7.7016416845110638E-2,14000,0,0,14000]
["    Sainte-Anne-des-Lacs",0,0,3900,1,0,0,0,0,0,0,3900,0,0,3900]
["    Sainte-Marguerite-du-Lac-Masson",0,0,800,0.24383724383724384,0,0,1800,0.53786753786753783,700,0.21532521532521531,3400,0,2.9700029700029701E-3,3400]
["    Saint-Sauveur",2000,0.17089810017271156,600,5.2417962003454228E-2,7800,0.6733160621761658,0,0,1200,0.10336787564766839,11600,0,0,11600]
["    Wentworth-Nord",0,0,900,0.56459330143540665,0,0,700,0.4354066985645933,0,0,1700,0,0,1700]
["RLS Les Laurentides",2800,5.4394706264647381E-2,8800,0.17309017862418025,9100,0.17953010221163124,13400,0.2637611517025425,14800,0.29115544439411545,48800,1900,3.8068416802883198E-2,50800]
["    Amherst",0,0,0,0,0,0,1000,0.60185185185185186,700,0.39814814814814814,1700,0,0,1700]
["    Arundel",0,0,0,0,0,0,0,0,600,1,600,0,0,600]
["    Barkmere",0,0,0,0,0,0,0,0,0,0,0,100,1,100]
["    Brébeuf",0,0,0,0,0,0,600,0.554013875123885,500,0.445986124876115,1000,0,0,1000]
["    Huberdeau",0,0,0,0,0,0,0,0,900,1,900,0,0,900]
["    Ivry-sur-le-Lac",400,1,0,0,0,0,0,0,0,0,400,0,0,400]
["    La Conception",0,0,600,0.37851997380484614,0,0,900,0.62148002619515386,0,0,1500,0,0,1500]
["    La Minerve",0,0,700,0.45812807881773393,0,0,800,0.54187192118226601,0,0,1400,0,0,1400]
["    Labelle",0,0,800,0.27233273056057866,0,0,1500,0.54575045207956596,500,0.18191681735985538,2800,0,0,2800]
["    Lac-Supérieur",0,0,600,0.28346855983772817,0,0,1400,0.71653144016227177,0,0,2000,0,0,2000]
["    Lac-Tremblant-Nord",0,0,0,0,0,0,0,0,0,0,0,100,1,100]
["    Lantier",0,0,0,0,0,0,900,1,0,0,900,0,0,900]
["    Montcalm",0,0,600,1,0,0,0,0,0,0,600,0,0,600]
["    Mont-Tremblant",1600,0.14637918486171761,1100,9.6160844250363905E-2,2600,0.23981077147016014,0,0,4500,0.41184497816593885,9800,1200,0.1058042212518195,11000]
["    Sainte-Agathe-des-Monts",0,0,1800,0.16100258674516099,2700,0.24128088484524132,2200,0.19650343412719651,3900,0.34510748372134509,10600,600,5.6105610561056105E-2,11200]
["    Sainte-Lucie-des-Laurentides",0,0,0,0,0,0,1400,1,0,0,1400,0,0,1400]
["    Mont-Blanc",800,0.20158730158730159,600,0.15608465608465608,600,0.1492063492063492,1900,0.49312169312169307,0,0,3800,0,0,3800]
["    Val-David",0,0,1100,0.19773299748110829,3200,0.57772580064771506,0,0,1200,0.22454120187117665,5600,0,0,5600]
["    Val-des-Lacs",0,0,0,0,0,0,800,1,0,0,800,0,0,800]
["    Val-Morin",0,0,1100,0.34101825168107586,0,0,0,0,2100,0.65898174831892409,3100,0,0,3100]
["RLS Antoine-Labelle",700,1.8622127146069881E-2,2000,5.6140639569963249E-2,500,1.3054687071471669E-2,25700,0.7056661730020295,4900,0.13460589106467008,33800,2600,7.1910482145795623E-2,36500]
["    Chute-Saint-Philippe",0,0,0,0,0,0,1000,1,0,0,1000,0,0,1000]
["    Ferme-Neuve",0,0,0,0,0,0,2300,0.84020618556701043,400,0.15979381443298968,2700,0,0,2700]
["    Kiamika",0,0,0,0,0,0,800,1,0,0,800,0,0,800]
["    La Macaza",0,0,0,0,0,0,500,0.41590493601462525,0,0,500,600,0.58409506398537481,1100]
["    Lac-des-Écorces",0,0,0,0,0,0,2300,0.81351819757365684,500,0.18648180242634316,2900,0,0,2900]
["    Lac-du-Cerf",0,0,0,0,0,0,400,1,0,0,400,0,0,400]
["    Lac-Saguay",0,0,0,0,0,0,500,1,0,0,500,0,0,500]
["    Lac-Saint-Paul",0,0,0,0,0,0,500,1,0,0,500,0,0,500]
["    L'Ascension",0,0,0,0,0,0,900,1,0,0,900,0,0,900]
["    Mont-Laurier",700,4.8000000000000001E-2,2000,0.14400000000000002,500,3.4000000000000002E-2,6200,0.43942172073342739,2800,0.19527503526093087,12200,2000,0.13949224259520451,14200]
["    Mont-Saint-Michel",0,0,0,0,0,0,600,1,0,0,600,0,0,600]
["    Nominingue",0,0,0,0,0,0,1900,0.85277161862527717,300,0.14722838137472283,2300,0,0,2300]
["    Notre-Dame-de-Pontmain",0,0,0,0,0,0,800,1,0,0,800,0,0,800]
["    Notre-Dame-du-Laus",0,0,0,0,0,0,1700,1,0,0,1700,0,0,1700]
["    Rivière-Rouge",0,0,0,0,0,0,3800,0.81969337076225424,800,0.18030662923774565,4600,0,0,4600]
["    Saint-Aimé-du-Lac-des-îles",0,0,0,0,0,0,800,1,0,0,800,0,0,800]
["    Sainte-Anne-du-Lac",0,0,0,0,0,0,600,0.9910873440285205,0,0,600,0,8.9126559714795012E-3,600]
["   Territoires non organisés","ND","ND","ND","ND","ND","ND","ND","ND","ND","ND","ND","ND","ND","ND"]
["Source : INSPQ et BIESP, 2023. Statistique Canada, Recensement 2021."]
["Panorama de la défavorisation dans les Laurentides 2021, produit par l’équipe Surveillance, recherche et évaluation, Direction de santé publique des Laurentides, Centre intégré de santé et de services sociaux des Laurentides, 2024"]
["La population sans indice réside dans des secteurs où l’information pour le calcul de l’indice est indisponible à cause des ménages collectifs (centres d’hébergement, pénitenciers) ou du taux de non-réponse trop élevé."]
[]
[]
[]
[]
[]
[]
[]
[]
[]
[]
[]
[]
[]
[]
[]
[]
[]
[]
[]
[]
[]
[]
[]
[]
[]
[]
[]
[]
[]
[]
[]
[]
[]
[]
[]
[]
[]
[]
[]
[]
[]
[]
[]
[]
[]
[]
[]
[]
[]
[]
[]
[]
[]
[]
[]
[]
[]
[]
[]
[]
[]
[]
[]
[]
[]
[]
[]
[]
[]
[]
[]
[]
[]
[]
[]
[]
[]
[]
[]
[]
[]
[]
[]
[]
[]
[]
[]
[]
[]
[]
[]
[]
[]
[]
[]
[]
[]
[]
[]
[]
[]
[]
[]
[]
[]
[]
[]
[]
[]
[]
[]
[]
[]
[]
[]
[]
[]
[]
[]
[]
[]
[]
[]
[]
[]
[]
[]
[]
[]
[]
[]
[]
[]
[]
[]
[]
[]
[]
["Défavorisation matérielle 2016 MRC  ---- LOCAL ----"]
[]
["MATERIEL","Conditions\nplus favorables",null,null,null,"Conditions\nplus défavorables",null,"Population avec indice","Population\nsans indice",null,"Population totale"]
[null,"Quartile 1",null,"Quartile 2-3",null,"Quartile 4"]
[null,"N","%","N","%","N","%","N","N","%","N"]
["MRC Deux-Montagnes",27020,0.27740358946979343,46140,0.47374635508645119,24240,0.24885005544375538,97400,807,8.2176715578953802E-3,98200]
["    Saint-Eustache",11140,0.25785770494838678,22350,0.51731241031338238,9710,0.22482988473823079,43210,802,1.8223959280130885E-2,44010]
["    Deux-Montagnes",6940,0.39666209419295839,8610,0.49194101508916321,1950,0.11139689071787837,17500,0,0,17500]
["    Sainte-Marthe-sur-le-Lac",8480,0.4694035631293571,5120,0.28316919331636603,4470,0.24742724355427687,18070,0,0,18070]
["    Pointe-Calumet",0,0,1000,0.15556938394523959,5430,0.84443061605476044,6430,0,0,6430]
["    Saint-Joseph-du-Lac",0,0,5670,0.84731568715417971,1020,0.15268431284582024,6690,0,0,6690]
["    Oka",450,0.11861743912018853,2740,0.71615606179628177,630,0.16522649908352971,3820,5,1.307531380753138E-3,3820]
["    Saint-Placide",0,0,660,0.39383155397390274,1020,0.60616844602609732,1690,0,0,1690]
["MRC Thérèse-De Blainville",37410,0.25074570840622845,74600,0.50001675749227481,37180,0.24923753410149677,149190,7916,5.0387325512561823E-2,157100]
["    Boisbriand",5010,0.18617021276595744,14100,0.52440113078410955,7780,0.28942865644993304,26880,0,0,26880]
["    Sainte-Thérèse",4030,0.17946436515704245,9620,0.42792953109707271,8830,0.39260610374588484,22480,3511,0.13509561737658241,25990]
["    Blainville",14710,0.26946392923206536,31760,0.58158275489459899,8130,0.14895331587333566,54600,2262,3.9779821676661449E-2,56860]
["    Rosemère",7560,0.56386548355827304,5850,0.43613451644172696,0,0,13410,547,3.9188995558102881E-2,13960]
["    Lorraine",3540,0.37820786997433703,5820,0.62179213002566291,0,0,9350,0,0,9350]
["    Bois-des-Filion",2560,0.27429736108131303,4270,0.45794893799613817,2500,0.2677537009225488,9320,314,3.2586135325861354E-2,9640]
["    Sainte-Anne-des-Plaines",0,0,3190,0.24286475378643732,9950,0.75713524621356265,13140,1282,8.8898134664725056E-2,14420]
["Mirabel",11860,0.23473165323778036,26400,0.52267733058816546,12250,0.24259101617405421,50510,0,0,50510]
["    Mirabel",11860,0.23473165323778036,26400,0.52267733058816546,12250,0.24259101617405421,50510,0,0,50510]
["MRC la Rivière-du-Nord",30490,0.25120916244386765,61410,0.50595311663164833,29470,0.242837720924484,121370,6805,5.309354763205118E-2,128170]
["    Saint-Colomban",3310,0.20681690492540108,12310,0.76840002497034776,400,2.4783070104251202E-2,16020,0,0,16020]
["    Saint-Jérôme",15720,0.23268829303682209,28510,0.42212878103670365,23310,0.34518292592647432,67540,6805,9.1531487907890133E-2,74350]
["    Sainte-Sophie",1510,9.604843849585723E-2,9690,0.61784576163161253,4490,0.28610579987253026,15690,0,0,15690]
["    Prévost",7560,0.58114136286725115,4760,0.36625134594677744,680,5.2607291185971392E-2,13000,0,0,13000]
["    Saint-Hippolyte",2400,0.26292110172281358,6130,0.67255568967409196,590,6.4523208603094476E-2,9110,0,0,9110]
["MRC Argenteuil",7960,0.25482538971223712,16160,0.5173329919016677,7120,0.22784161838609521,31240,1148,3.5444132267127726E-2,32390]
["    Saint-André-d'Argenteuil",610,0.20132450331125828,2410,0.79867549668874172,0,0,3020,0,0,3020]
["    Lachute",630,5.3440327812873487E-2,7150,0.61072221273689598,3930,0.33583745945023047,11710,1148,8.925517026900949E-2,12860]
["    Gore",900,0.47006302521008403,1010,0.52993697478991597,0,0,1900,0,0,1900]
["    Mille-Isles",820,0.52201659221442243,750,0.47798340778557752,0,0,1570,0,0,1570]
["    Wentworth",530,1,0,0,0,0,530,0,0,530]
["    Brownsburg-Chatham",1760,0.24712159505756809,2760,0.38725077225498455,2600,0.36562763268744736,7120,0,0,7120]
["    Grenville-sur-la-Rouge",1160,0.41218130311614731,1080,0.38243626062322944,580,0.20538243626062322,2820,0,0,2820]
["    Grenville",710,0.41554646405610751,1000,0.58445353594389249,0,0,1710,0,0,1710]
["    Harrington",850,1,0,0,0,0,850,0,0,850]
["MRC Les Pays-d'en-Haut",11190,0.27286254421270889,19680,0.4801317233809001,10130,0.24700573240639101,41000,882,2.106168063614872E-2,41880]
["    Estérel",0,0,200,1,0,0,200,0,0,200]
["    Sainte-Marguerite-du-Lac-Masson",0,0,640,0.2310207046857973,2120,0.76897929531420273,2750,10,3.619254433586681E-3,2760]
["    Sainte-Adèle",1070,8.2591531852310551E-2,7440,0.57566375106432388,4420,0.34174471708336557,12920,0,0,12920]
["    Piedmont",2950,1,0,0,0,0,2950,0,0,2950]
["    Sainte-Anne-des-Lacs",2870,0.79562448075325398,740,0.20437551924674605,0,0,3610,0,0,3610]
["    Saint-Sauveur",3330,0.35548669729671972,6030,0.64451330270328022,0,0,9360,872,8.5231160199394002E-2,10230]
["    Morin-Heights",970,0.23377563329312426,1790,0.43136308805790108,1390,0.33486127864897469,4150,0,0,4150]
["    Lac-des-Seize-îles",0,0,0,0,170,1,170,0,0,170]
["    Wentworth-Nord",0,0,710,0.51629254163649529,670,0.48370745836350471,1380,0,0,1380]
["    Saint-Adolphe-d'Howard",0,0,2140,0.61071530350527214,1370,0.38928469649472786,3510,0,0,3510]
["MRC Les Laurentides",10870,0.25342817164179104,21870,0.51002798507462688,10140,0.23654384328358208,42880,3022,6.5835911289268439E-2,45900]
["    Val-Morin",630,0.2205574912891986,2240,0.77944250871080134,0,0,2870,0,0,2870]
["    Val-David",3260,0.66381940207443568,1650,0.33618059792556437,0,0,4920,0,0,4920]
["    Lantier",0,0,830,1,0,0,830,0,0,830]
["    Sainte-Lucie-des-Laurentides",0,0,1260,1,0,0,1260,0,0,1260]
["    Sainte-Agathe-des-Monts",1890,0.21492672952402589,3500,0.39713733954333752,3420,0.38793593093263662,8800,1420,0.13890247481169912,10220]
["    Ivry-sur-le-Lac",0,0,390,1,0,0,390,0,0,390]
["    St-Faustin—Lac-Carré",490,0.13918262360674477,2550,0.72849385538725353,460,0.13232352100600173,3500,0,0,3500]
["    Barkmere",0,0,60,1,0,0,60,0,0,60]
["    Montcalm",0,0,0,0,630,1,630,0,0,630]
["    Arundel",560,1,0,0,0,0,560,0,0,560]
["    Huberdeau",0,0,870,1,0,0,870,0,0,870]
["    Amherst",0,0,0,0,1480,1,1480,0,0,1480]
["    Brébeuf",0,0,410,0.41598360655737704,570,0.58401639344262291,980,0,0,980]
["    Lac-Supérieur",510,0.2701271186440678,1380,0.7298728813559322,0,0,1890,0,0,1890]
["    Val-des-Lacs",0,0,0,0,740,1,740,0,0,740]
["    Mont-Tremblant",2920,0.36263053207359525,4540,0.56439582297364499,590,7.297364495275982E-2,8040,1602,0.16607920381505287,9650]
["    La Conception",560,0.41810022438294692,780,0.58189977561705308,0,0,1340,0,0,1340]
["    Labelle",0,0,1430,0.57731126362535323,1050,0.42268873637464677,2480,0,0,2480]
["    Lac-Tremblant-Nord",40,1,0,0,0,0,40,0,0,40]
["    La Minerve",0,0,0,0,1210,1,1210,0,0,1210]
["MRC Antoine-Labelle",8350,0.25862602985814287,15910,0.49287616923744038,8020,0.24849780090441678,32290,2957,8.3903186448372732E-2,35240]
["    Notre-Dame-du-Laus",0,0,570,0.3645699614890886,990,0.6354300385109114,1560,0,0,1560]
["    Notre-Dame-de-Pontmain",0,0,0,0,780,1,780,0,0,780]
["    Lac-du-Cerf",0,0,440,1,0,0,440,0,0,440]
["    Saint-Aimé-du-Lac-des-îles",0,0,790,1,0,0,790,0,0,790]
["    Kiamika",0,0,760,1,0,0,760,0,0,760]
["    Nominingue",970,0.45297145531118388,480,0.22274216190921853,690,0.32428638277959759,2140,0,0,2140]
["    Rivière-Rouge",1270,0.2938454419250347,2200,0.50786672836649704,860,0.19828782970846831,4320,0,0,4320]
["    La Macaza",440,1,0,0,0,0,440,711,0.61826086956521742,1150]
["    L'Ascension",0,0,0,0,790,1,790,0,0,790]
["    Lac-Saguay",0,0,460,1,0,0,460,0,0,460]
["    Chute-Saint-Philippe",440,0.4713375796178344,500,0.5286624203821656,0,0,940,0,0,940]
["    Lac-des-Écorces",690,0.25164594001463059,1470,0.5369422092172641,580,0.21141185076810534,2730,0,0,2730]
["    Mont-Laurier",4540,0.38240000000000002,5820,0.48976842105263158,1520,0.12783157894736841,11880,2241,0.15875602153584584,14120]
["    Ferme-Neuve",0,0,1400,0.51552106430155209,1310,0.48447893569844791,2710,0,0,2710]
["    Lac-Saint-Paul",0,0,480,1,0,0,480,0,0,480]
["   Mont-Saint-Michel",0,0,0,0,500,1,500,0,0,500]
["   Sainte-Anne-du-Lac",0,0,580,1,0,0,580,0,0,580]
["   Territoires non organisés",0,0,0,0,0,0,0,5,1,10]
[]
["Défavorisation sociale 2016 MRC  ---- LOCAL ----"]
[]
["SOCIAL","Conditions\nplus favorables",null,null,null,"Conditions\nplus défavorables",null,"Population avec indice","Population\nsans indice",null,"Population totale"]
[null,"Quartile 1",null,"Quartile 2-3",null,"Quartile 4"]
[null,"N","%","N","%","N","%","N","N","%","N"]
["MRC Deux-Montagnes",24400,0.25049283338124767,48980,0.50287486139061155,24020,0.24663230522814078,97400,810,8.2176715578953802E-3,98200]
["    Saint-Eustache",14390,0.33293986946257464,15040,0.34805351108642318,13780,0.31900661945100217,43210,800,1.8223959280130885E-2,44010]
["    Deux-Montagnes",2580,0.14769090077732053,8470,0.48422496570644719,6440,0.36808413351623226,17500,0,0,17500]
["    Sainte-Marthe-sur-le-Lac",1740,9.6270886356091628E-2,15120,0.83628416509903725,1220,6.7444948544871083E-2,18070,0,0,18070]
["    Pointe-Calumet",1030,0.16008089607965154,2820,0.4387056627255756,2580,0.40121344119477287,6430,0,0,6430]
["    Saint-Joseph-du-Lac",3560,0.53207716464782417,3130,0.46792283535217588,0,0,6690,0,0,6690]
["    Oka",630,0.16522649908352971,3190,0.83477350091647029,0,0,3820,10,1.307531380753138E-3,3820]
["    Saint-Placide",470,0.27876631079478054,1220,0.72123368920521946,0,0,1690,0,0,1690]
["MRC Thérèse-De Blainville",37700,0.2526962805070147,74910,0.50211479552507932,36580,0.24518892396790606,149190,7920,5.0387325512561823E-2,157100]
["    Boisbriand",4280,0.15931409016515399,15740,0.58536676089867579,6860,0.25531914893617019,26880,0,0,26880]
["    Sainte-Thérèse",2060,9.1734140048046975E-2,5440,0.2419254382062461,14980,0.66634042174570696,22480,3510,0.13509561737658241,25990]
["    Blainville",15070,0.27598395633779599,32930,0.60313913664584895,6600,0.12087690701635501,54600,2260,3.9779821676661449E-2,56860]
["    Rosemère",6110,0.45529788979196184,4870,0.36343300275892926,2430,0.18126910744910893,13410,550,3.9188995558102881E-2,13960]
["    Lorraine",4120,0.44076133447390931,5230,0.55923866552609069,0,0,9350,0,0,9350]
["    Bois-des-Filion",520,5.524565543874705E-2,4060,0.43542158335121217,4750,0.50933276121004079,9320,310,3.2586135325861354E-2,9640]
["    Sainte-Anne-des-Plaines",5540,0.42179770149935308,6640,0.50528959585965449,960,7.2912702640992463E-2,13140,1280,8.8898134664725056E-2,14420]
["Mirabel",13630,0.26979193474947044,24900,0.49302159840041176,11980,0.23718646685011779,50510,0,0,50510]
["    Mirabel",13630,0.26979193474947044,24900,0.49302159840041176,11980,0.23718646685011779,50510,0,0,50510]
["MRC la Rivière-du-Nord",31240,0.25742182672104807,60080,0.49506035512709595,30040,0.24751781815185597,121370,6810,5.309354763205118E-2,128170]
["    Saint-Colomban",8840,0.55203196204507143,7180,0.44796803795492851,0,0,16020,0,0,16020]
["    Saint-Jérôme",12490,0.18493951821856353,27190,0.40261470810322619,27860,0.41244577367821028,67540,6810,9.1531487907890133E-2,74350]
["    Sainte-Sophie",3820,0.24333970681963032,11870,0.75666029318036965,0,0,15690,0,0,15690]
["    Prévost",4880,0.37517305029995385,5940,0.45692970312259651,2180,0.16789724657744962,13000,0,0,13000]
["    Saint-Hippolyte",1210,0.13299681773290903,7900,0.86700318226709094,0,0,9110,0,0,9110]
["MRC Argenteuil",7940,0.25408917768317274,16200,0.51848532377324674,7110,0.22742549854358055,31240,1150,3.5444132267127726E-2,32390]
["    Saint-André-d'Argenteuil",510,0.16986754966887418,2510,0.83013245033112582,0,0,3020,0,0,3020]
["    Lachute",1560,0.1328325081099539,5420,0.46243810824654258,4740,0.40472938364350353,11710,1150,8.925517026900949E-2,12860]
["    Gore",1010,0.52993697478991597,900,0.47006302521008403,0,0,1900,0,0,1900]
["    Mille-Isles",750,0.47798340778557752,820,0.52201659221442243,0,0,1570,0,0,1570]
["    Wentworth",530,1,0,0,0,0,530,0,0,530]
["    Brownsburg-Chatham",1850,0.25961808480763832,4620,0.64869418702611625,650,9.168772816624543E-2,7120,0,0,7120]
["    Grenville-sur-la-Rouge",1730,0.6122521246458924,1100,0.38774787535410765,0,0,2820,0,0,2820]
["    Grenville",0,0,0,0,1710,1,1710,0,0,1710]
["    Harrington",0,0,850,1,0,0,850,0,0,850]
["MRC Les Pays-d'en-Haut",10330,0.25195755579948775,20510,0.50020734235882425,10160,0.247835101841688,41000,880,2.106168063614872E-2,41880]
["    Estérel",200,1,0,0,0,0,200,0,0,200]
["    Sainte-Marguerite-du-Lac-Masson",840,0.30439520523065744,1920,0.69560479476934256,0,0,2750,10,3.619254433586681E-3,2760]
["    Sainte-Adèle",3090,0.2391051939004567,4640,0.35916092576824832,5190,0.40173388033129498,12920,0,0,12920]
["    Piedmont",0,0,1170,0.3976271186440678,1780,0.60237288135593225,2950,0,0,2950]
["    Sainte-Anne-des-Lacs",2880,0.79783993353641647,730,0.2021600664635835,0,0,3610,0,0,3610]
["    Saint-Sauveur",0,0,6910,0.73875414039961529,2450,0.26124585960038466,9360,870,8.5231160199394002E-2,10230]
["    Morin-Heights",1760,0.42484921592279856,2380,0.57515078407720144,0,0,4150,0,0,4150]
["    Lac-des-Seize-îles",170,1,0,0,0,0,170,0,0,170]
["    Wentworth-Nord",670,0.48370745836350471,710,0.51629254163649529,0,0,1380,0,0,1380]
["    Saint-Adolphe-d'Howard",720,0.20632658877172982,2040,0.58050726702764321,750,0.21316614420062696,3510,0,0,3510]
["MRC Les Laurentides",11290,0.26329291044776121,21220,0.49496268656716419,10370,0.24174440298507463,42880,3020,6.5835911289268439E-2,45900]
["    Val-Morin",0,0,2240,0.77944250871080134,630,0.2205574912891986,2870,0,0,2870]
["    Val-David",0,0,2710,0.55053894651210089,2210,0.44946105348789911,4920,0,0,4920]
["    Lantier",0,0,830,1,0,0,830,0,0,830]
["    Sainte-Lucie-des-Laurentides",610,0.48168789808917195,650,0.51831210191082799,0,0,1260,0,0,1260]
["    Sainte-Agathe-des-Monts",1260,0.14279222992161764,4590,0.5210723616948767,2960,0.33613540838350564,8800,1420,0.13890247481169912,10220]
["    Ivry-sur-le-Lac",390,1,0,0,0,0,390,0,0,390]
["    St-Faustin—Lac-Carré",2040,0.58188053729637035,950,0.27150614461274653,510,0.1466133180908831,3500,0,0,3500]
["    Barkmere",0,0,0,0,60,1,60,0,0,60]
["    Montcalm",630,1,0,0,0,0,630,0,0,630]
["    Arundel",0,0,0,0,560,1,560,0,0,560]
["    Huberdeau",0,0,870,1,0,0,870,0,0,870]
["    Amherst",830,0.56132075471698117,650,0.43867924528301888,0,0,1480,0,0,1480]
["    Brébeuf",980,1,0,0,0,0,980,0,0,980]
["    Lac-Supérieur",1260,0.6652542372881356,630,0.3347457627118644,0,0,1890,0,0,1890]
["    Val-des-Lacs",740,1,0,0,0,0,740,0,0,740]
["    Mont-Tremblant",540,6.7503729487817007E-2,4070,0.5060914967677772,3430,0.42640477374440577,8040,1600,0.16607920381505287,9650]
["    La Conception",780,0.58189977561705308,560,0.41810022438294692,0,0,1340,0,0,1340]
["    Labelle",0,0,2480,1,0,0,2480,0,0,2480]
["    Lac-Tremblant-Nord",40,1,0,0,0,0,40,0,0,40]
["    La Minerve",1210,1,0,0,0,0,1210,0,0,1210]
["MRC Antoine-Labelle",8340,0.25816143219971505,15900,0.49256643746515516,8050,0.24927213033512977,32290,2960,8.3903186448372732E-2,35240]
["    Notre-Dame-du-Laus",460,0.2952503209242619,1100,0.70474967907573816,0,0,1560,0,0,1560]
["    Notre-Dame-de-Pontmain",780,1,0,0,0,0,780,0,0,780]
["    Lac-du-Cerf",0,0,440,1,0,0,440,0,0,440]
["    Saint-Aimé-du-Lac-des-îles",790,1,0,0,0,0,790,0,0,790]
["    Kiamika",0,0,760,1,0,0,760,0,0,760]
["    Nominingue",800,0.37295273748245206,1340,0.62704726251754794,0,0,2140,0,0,2140]
["    Rivière-Rouge",0,0,3090,0.71402128644146223,1240,0.28597871355853771,4320,0,0,4320]
["    La Macaza",0,0,0,0,440,1,440,710,0.61826086956521742,1150]
["    L'Ascension",370,0.47029077117572693,420,0.52970922882427307,0,0,790,0,0,790]
["    Lac-Saguay",0,0,0,0,460,1,460,0,0,460]
["    Chute-Saint-Philippe",500,0.5286624203821656,440,0.4713375796178344,0,0,940,0,0,940]
["    Lac-des-Écorces",510,0.1869056327724945,1770,0.64850036576444769,450,0.1645940014630578,2730,0,0,2730]
["    Mont-Laurier",2700,0.22694736842105262,3720,0.31292631578947366,5460,0.46012631578947366,11880,2240,0.15875602153584584,14120]
["    Ferme-Neuve",1430,0.52845528455284552,1280,0.47154471544715448,0,0,2710,0,0,2710]
["    Lac-Saint-Paul",0,0,480,1,0,0,480,0,0,480]
["   Mont-Saint-Michel",0,0,500,1,0,0,500,0,0,500]
["   Sainte-Anne-du-Lac",0,0,580,1,0,0,580,0,0,580]
["   Territoires non organisés",0,0,0,0,0,0,0,5,1,10]
[]
["Défavorisation matérielle et sociale 2016 MRC  ---- RÉGIONAL ----"]
["Répartition de la population selon les niveaux de DÉFAVORISATION MATÉRIELLE et SOCIALE des MUNICIPALITÉS des MRC de la région des Laurentides, 2016\n"]
[null,"Profil 1",null,"Profil 2",null,"Profil 3",null,"Profil 4",null,"Profil 5",null,"Population avec indice","Population\nsans indice",null,"Population totale"]
[null,"matériellement \nET socialement \nplus favorables",null,"moyennes matériellement\nEt socialement",null,"socialement\nplus défavorables\n(pas matériellement)",null,"matériellement\nplus défavorables\n(pas socialement)",null,"matériellement\nET socialement\nplus défavorables"]
[null,"N","%","N","%","N","%","N","%","N","%","N","N","%","N"]
["Région des Laurentides",82250,0.14535850550398241,123150,0.21762511420608877,133580,0.23606950799044998,133340,0.23563300657579661,93550,0.16531386572368223,565860,23540,3.9933831014591109E-2,589400]
["MRC Deux-Montagnes",13300,0.13650457924350076,33470,0.34368967924760768,19320,0.19836543595219516,18030,0.18507946938272618,13280,0.13636083617397018,97400,810,6.8916045397484187E-3,98200]
["    Saint-Eustache",5910,0.13667083275470998,14360,0.33229181132250152,9040,0.2092764893764755,4570,0.10579549136693978,9330,0.2159653751793732,43210,800,1.8223959280130885E-2,44010]
["    Deux-Montagnes",3070,0.17529721079103794,3720,0.21244855967078188,8760,0.50085733882030181,1500,8.5619570187471419E-2,450,2.577732053040695E-2,17500,0,0,17500]
["    Sainte-Marthe-sur-le-Lac",3870,0.21411972999889342,8510,0.47100807790195859,380,2.1245988713068497E-2,4470,0.24742724355427687,840,4.6198959831802583E-2,18070,0,0,18070]
["    Pointe-Calumet",0,0,0,0,470,7.2650902302426879E-2,3850,0.59878655880522713,2110,0.32856253889234599,6430,0,0,6430]
["    Saint-Joseph-du-Lac",0,0,5290,0.79138627187079402,0,0,1400,0.20861372812920592,0,0,6690,0,0,6690]
["    Oka",450,0.11861743912018854,1600,0.41764859910971458,0,0,1770,0.4637339617700969,0,0,3820,10,1.307531380753138E-3,3820]
["    Saint-Placide",0,0,0,0,660,0.39383155397390274,470,0.27876631079478054,550,0.32740213523131673,1690,0,0,1690]
["Région des Laurentides",82250,0.14535850550398241,123150,0.21762511420608877,133580,0.23606950799044998,133340,0.23563300657579661,93550,0.16531386572368223,565860,23540,3.9933831014591109E-2,589400]
["MRC/RLS Thérèse-De Blainville",50110,0.33586706616528245,21540,0.14438255343964287,44600,0.29896706817618157,18880,0.12657939364689952,14050,9.4203918571993533E-2,149190,7920,5.0387325512561823E-2,157100]
["    Boisbriand",5920,0.22005653920547538,6830,0.25412884987353074,7430,0.27629816991519118,2490,9.2731736348757629E-2,4220,0.15678470465704508,26880,0,0,26880]
["    Sainte-Thérèse",3230,0.14351810659311326,1000,4.4621407598540802E-2,9870,0.43914049292641694,370,1.6327075362576743E-2,8010,0.35639291751935226,22480,3510,0.13509561737658241,25990]
["    Blainville",23510,0.4306148239043241,7780,0.1425431768648926,16410,0.30061720481309867,5630,0.10303840589000203,1270,2.3186388527682643E-2,54600,2260,3.9779821676661449E-2,56860]
["    Rosemère",7770,0.57915144284542541,1900,0.14145104764745359,3750,0.279397509507121,0,0,0,0,13410,550,3.9188995558102881E-2,13960]
["    Lorraine",7790,0.83329769033361845,1140,0.12200598802395209,420,4.4696321642429426E-2,0,0,0,0,9350,0,0,9350]
["    Bois-des-Filion",1030,0.1103840377601373,1050,0.11306586569405706,5770,0.61853679467925338,910,9.7725809912036041E-2,560,6.0287491954516194E-2,9320,310,3.2586135325861354E-2,9640]
["    Sainte-Anne-des-Plaines",860,6.5758429104193619E-2,1830,0.13928000608874344,960,7.2912702640992463E-2,9490,0.72204886216607056,0,0,13140,1280,8.8898134664725056E-2,14420]
["Région des Laurentides",82250,0.14535850550398241,123150,0.21762511420608877,133580,0.23606950799044998,133340,0.23563300657579661,93550,0.16531386572368223,565860,23540,3.9933831014591109E-2,589400]

{"sheet":"Région","index":1,"n_rows":0,"n_cols":0,"rows_kept":0,"cut":false,"hidden":false,"merged":[]}

{"sheet":"Donnees_Local","index":2,"n_rows":1218,"n_cols":29,"rows_kept":1218,"cut":false,"hidden":false,"merged":[[918,0,918,14],[919,1,919,2],[919,9,919,10],[919,11,920,11],[919,12,920,13],[919,14,920,14],[920,1,920,2],[920,3,920,4],[920,5,920,6],[920,7,920,8],[920,9,920,10],[903,0,903,14],[904,1,904,2],[904,9,904,10],[904,11,905,11],[904,12,905,13],[904,14,905,14],[905,1,905,2],[905,3,905,4],[905,5,905,6],[905,7,905,8],[905,9,905,10],[887,0,887,14],[888,1,888,2],[888,9,888,10],[888,11,890,11],[888,12,890,13],[888,14,890,14],[889,1,889,2],[889,3,889,4],[889,5,889,6],[889,7,889,8],[889,9,889,10],[890,1,890,2],[890,3,890,4],[890,5,890,6],[890,7,890,8],[890,9,890,10],[870,0,870,14],[871,1,871,2],[871,9,871,10],[871,11,872,11],[871,12,872,13],[871,14,872,14],[872,1,872,2],[872,3,872,4],[872,5,872,6],[872,7,872,8],[872,9,872,10],[856,0,856,14],[857,1,857,2],[857,9,857,10],[857,11,858,11],[857,12,858,13],[857,14,858,14],[858,1,858,2],[858,3,858,4],[858,5,858,6],[858,7,858,8],[858,9,858,10],[841,0,841,14],[842,1,842,2],[842,9,842,10],[842,11,844,11],[842,12,844,13],[842,14,844,14],[843,1,843,2],[843,3,843,4],[843,5,843,6],[843,7,843,8],[843,9,843,10],[844,1,844,2],[844,3,844,4],[844,5,844,6],[844,7,844,8],[844,9,844,10],[457,0,457,14],[458,1,458,2],[458,9,458,10],[458,11,459,11],[458,12,459,13],[458,14,459,14],[458,3,458,4],[458,5,458,6],[458,7,458,8],[459,1,459,2],[459,3,459,4],[459,5,459,6],[459,7,459,8],[459,9,459,10],[276,5,276,6],[276,7,277,7],[276,8,277,9],[276,10,277,10],[367,1,367,2],[367,5,367,6],[367,7,368,7],[367,8,368,9],[367,10,368,10],[368,1,368,2],[368,3,368,4],[368,5,368,6],[276,1,276,2],[277,1,277,2],[277,3,277,4],[277,5,277,6],[810,0,810,14],[811,1,811,2],[811,9,811,10],[811,11,812,11],[811,12,812,13],[811,14,812,14],[812,1,812,2],[812,3,812,4],[812,5,812,6],[812,7,812,8],[812,9,812,10],[764,9,764,10],[786,0,786,14],[787,1,787,2],[787,9,787,10],[787,11,788,11],[787,12,788,13],[787,14,788,14],[788,1,788,2],[788,3,788,4],[788,5,788,6],[788,7,788,8],[788,9,788,10],[93,0,93,14],[761,0,761,14],[762,1,762,2],[762,9,762,10],[762,11,764,11],[762,12,764,13],[762,14,764,14],[763,1,763,2],[763,3,763,4],[763,5,763,6],[763,7,763,8],[763,9,763,10],[764,1,764,2],[764,3,764,4],[764,5,764,6],[764,7,764,8],[94,14,95,14],[95,1,95,2],[95,3,95,4],[95,5,95,6],[95,7,95,8],[95,9,95,10],[94,1,94,2],[94,9,94,10],[1,0,1,14],[2,1,2,2],[2,9,2,10],[2,11,4,11],[2,12,4,13],[2,14,4,14],[3,1,3,2],[3,3,3,4],[3,5,3,6],[3,7,3,8],[3,9,3,10],[4,1,4,2],[4,3,4,4],[4,5,4,6],[4,7,4,8],[4,9,4,10],[94,11,95,11],[94,12,95,13],[184,0,184,14],[185,1,185,2],[185,9,185,10],[185,11,186,11],[185,12,186,13],[185,14,186,14],[186,1,186,2],[186,3,186,4],[186,5,186,6],[186,7,186,8],[186,9,186,10],[556,0,556,14],[557,1,557,2],[557,9,557,10],[557,11,558,11],[557,12,558,13],[557,14,558,14],[558,1,558,2],[558,3,558,4],[558,5,558,6],[558,7,558,8],[558,9,558,10],[655,0,655,14],[656,1,656,2],[656,9,656,10],[656,11,657,11],[656,12,657,13],[656,14,657,14],[657,1,657,2],[657,3,657,4],[657,5,657,6],[657,7,657,8],[657,9,657,10],[941,0,941,14],[942,1,942,2],[942,9,942,10],[942,11,944,11],[942,12,944,13],[942,14,944,14],[943,1,943,2],[943,3,943,4],[943,5,943,6],[943,7,943,8],[943,9,943,10],[944,1,944,2],[944,3,944,4],[944,5,944,6],[944,7,944,8],[944,9,944,10],[1035,0,1035,14],[1036,1,1036,2],[1036,9,1036,10],[1036,11,1037,11],[1036,12,1037,13],[1036,14,1037,14],[1037,1,1037,2],[1037,3,1037,4],[1037,5,1037,6],[1037,7,1037,8],[1037,9,1037,10],[1128,0,1128,14],[1129,1,1129,2],[1129,9,1129,10],[1129,11,1130,11],[1129,12,1130,13],[1129,14,1130,14],[1130,1,1130,2],[1130,3,1130,4],[1130,5,1130,6],[1130,7,1130,8],[1130,9,1130,10]]}
["ND"]
["Répartition de la population (N, %) par profil de défavorisation combinée 2021\nRégion des Laurentides (LOCAUX) 2021)"]
[null,"Conditions\nplus favorables",null,null,null,null,null,null,null,"Conditions\nplus défavorables",null,"Population\navec indice","Population\nsans indice",null,"Population\ntotale"]
[null,"Profil 1",null,"Profil 2",null,"Profil 3",null,"Profil 4",null,"Profil 5"]
[null,"matériellement \nET socialement \nplus favorables",null,"moyennes matériellement\nEt socialement",null,"socialement\nplus défavorables\n(pas matériellement)",null,"matériellement\nplus défavorables\n(pas socialement)",null,"matériellement\nET socialement\nplus défavorables"]
[null,"N","%","N","%","N","%","N","%","N","%","N   ","N","%","N"]
["MRC Deux-Montagnes",9300,9.094383255595187E-2,47400,0.46494924156312467,17500,0.17145180888174655,17500,0.17186336377533024,7700,7.5128365931093954E-2,99400,2600,2.5663387292752714E-2,102100,null,{"$f":"C7/100","v":9.0943832555951873E-4},null,{"$f":"E7/100","v":4.6494924156312463E-3},null,{"$f":"G7/100","v":1.7145180888174655E-3},null,{"$f":"I7/100","v":1.7186336377533024E-3},null,{"$f":"K7/100","v":7.5128365931093955E-4},null,null,{"$f":"N7/100","v":2.5663387292752712E-4}]
["    Deux-Montagnes",1800,9.8799888361708069E-2,7200,0.40307005302818866,7000,0.39263187273234723,1000,5.3921295004186437E-2,0,0,17000,900,5.1576890873569627E-2,17900,null,{"$f":"C8/100","v":9.8799888361708068E-4},null,{"$f":"E8/100","v":4.0307005302818869E-3},null,{"$f":"G8/100","v":3.9263187273234721E-3},null,{"$f":"I8/100","v":5.3921295004186437E-4},null,{"$f":"K8/100","v":0},null,null,{"$f":"N8/100","v":5.1576890873569628E-4}]
["    Oka",1200,0.30090725806451613,2300,0.56703629032258063,0,0,500,0.12953629032258066,0,0,4000,0,2.5201612903225806E-3,4000,null,3.0090725806451611E-3,null,5.6703629032258066E-3,null,0,null,1.2953629032258066E-3,null,0,null,null,2.5201612903225806E-5]
["    Pointe-Calumet",0,0,0,0,1000,0.16382741601655787,3300,0.52443878363317942,2000,0.31173380035026271,6300,0,0,6300,null,0,null,0,null,1.6382741601655786E-3,null,5.2443878363317943E-3,null,3.1173380035026273E-3,null,null,0]
["    Sainte-Marthe-sur-le-Lac",0,0,15800,0.79602970146991969,1900,9.6378239127140469E-2,2100,0.10759205940293985,0,0,19800,0,0,19800,null,0,null,7.9602970146991966E-3,null,9.6378239127140465E-4,null,1.0759205940293985E-3,null,0,null,null,0]
["    Saint-Eustache",5400,0.11818623553317431,16900,0.37373001148511359,7500,0.16622493153105394,8100,0.1785493418146479,5700,0.12609329446064141,43600,1700,3.721618517536885E-2,45300,null,1.1818623553317431E-3,null,3.7373001148511358E-3,null,1.6622493153105394E-3,null,1.785493418146479E-3,null,1.2609329446064141E-3,null,null,3.721618517536885E-4]
["    Saint-Joseph-du-Lac",1000,0.13739155169961598,4600,0.64756080216185463,0,0,1500,0.21504764613852939,0,0,7000,0,0,7000,null,1.3739155169961597E-3,null,6.4756080216185462E-3,null,0,null,2.1504764613852938E-3,null,0,null,null,0]
["    Saint-Placide",0,0,700,0.4176008968609865,0,0,1000,0.58239910313901344,0,0,1800,0,0,1800,null,0,null,4.1760089686098652E-3,null,0,null,5.8239910313901341E-3,null,0,null,null,0]
["MRC Thérèse-De Blainville",10100,6.1943874058863792E-2,78600,0.4800955803265865,26600,0.16244988755255696,26300,0.16086095629216779,12200,7.4313092793585611E-2,153800,9900,6.033660897623936E-2,163600,null,6.1943874058863787E-4,null,4.8009558032658653E-3,null,1.6244988755255696E-3,null,1.6086095629216778E-3,null,7.4313092793585613E-4,null,null,6.0336608976239363E-4]
["    Blainville",2800,4.6941607181664687E-2,39300,0.65681472441866295,5500,9.1910596967518673E-2,6500,0.10934652869489626,900,1.5831090456209566E-2,55100,4700,7.9155452281047825E-2,59800,null,4.6941607181664687E-4,null,6.5681472441866291E-3,null,9.1910596967518675E-4,null,1.0934652869489627E-3,null,1.5831090456209566E-4,null,null,7.9155452281047826E-4]
["    Boisbriand",600,2.006499929348594E-2,10500,0.37219160661297157,5400,0.18902783665394943,9500,0.33403984739296311,2400,8.4675710046629937E-2,28300,0,0,28300,null,2.006499929348594E-4,null,3.7219160661297159E-3,null,1.8902783665394943E-3,null,3.3403984739296313E-3,null,8.4675710046629941E-4,null,null,0]
["    Bois-des-Filion",0,0,2600,0.25976966236834337,4800,0.47662171473570231,2300,0.23004232700068905,0,0,9800,300,3.3566295895265282E-2,10200,null,0,null,2.5976966236834335E-3,null,4.766217147357023E-3,null,2.3004232700068903E-3,null,0,null,null,3.3566295895265283E-4]
["    Lorraine",3200,0.33350873500315731,6300,0.66649126499684275,0,0,0,0,0,0,9500,0,0,9500,null,3.3350873500315732E-3,null,6.6649126499684274E-3,null,0,null,0,null,0,null,null,0]
["    Rosemère",2700,0.19396735273243432,10200,0.72533711852377569,1100,8.0695528743789921E-2,0,0,0,0,14100,0,0,14100,null,1.9396735273243431E-3,null,7.2533711852377572E-3,null,8.0695528743789926E-4,null,0,null,0,null,null,0]
["    Sainte-Anne-des-Plaines",0,0,3200,0.20747651271269954,0,0,7600,0.50213520793640365,2800,0.18474476052821762,13600,1600,0.10564351882267919,15200,null,0,null,2.0747651271269952E-3,null,0,null,5.0213520793640368E-3,null,1.8474476052821763E-3,null,null,1.0564351882267919E-3]
["    Sainte-Thérèse",900,3.2337089661930427E-2,6400,0.24056834884860362,9800,0.36761768363924169,300,1.3002675913013982E-2,6000,0.22628424980213319,23300,3200,0.12018995213507708,26500,null,3.2337089661930426E-4,null,2.4056834884860364E-3,null,3.6761768363924169E-3,null,1.3002675913013982E-4,null,2.2628424980213318E-3,null,null,1.2018995213507707E-3]
["Mirabel",3500,5.6850166917588527E-2,30900,0.506382143090921,11200,0.18390390783530797,11700,0.19185703999476333,3700,6.1006742161419124E-2,61100,0,0,61100,null,5.6850166917588529E-4,null,5.0638214309092098E-3,null,1.8390390783530797E-3,null,1.9185703999476333E-3,null,6.100674216141912E-4,null,null,0]
["    Mirabel",3500,5.6850166917588527E-2,30900,0.506382143090921,11200,0.18390390783530797,11700,0.19185703999476333,3700,6.1006742161419124E-2,61100,0,0,61100,null,5.6850166917588529E-4,null,5.0638214309092098E-3,null,1.8390390783530797E-3,null,1.9185703999476333E-3,null,6.100674216141912E-4,null,null,0]
["MRC la Rivière-du-Nord",10600,7.5487556448281271E-2,71100,0.50631793381483536,19300,0.13742040258130689,21400,0.15247090331495647,15200,0.10793908571591379,137500,2900,2.0364118124706187E-2,140400,null,7.5487556448281272E-4,null,5.0631793381483541E-3,null,1.3742040258130689E-3,null,1.5247090331495647E-3,null,1.0793908571591379E-3,null,null,2.0364118124706186E-4]
["    Prévost",3100,0.22334209757522638,8300,0.60816535203038269,2300,0.16849255039439087,0,0,0,0,13700,0,0,13700,null,2.233420975752264E-3,null,6.0816535203038272E-3,null,1.6849255039439086E-3,null,0,null,0,null,null,0]
["    Saint-Colomban",4500,0.25084554678692222,12500,0.70529875986471235,0,0,800,4.3855693348365275E-2,0,0,17700,0,0,17700,null,2.5084554678692222E-3,null,7.0529875986471233E-3,null,0,null,4.3855693348365273E-4,null,0,null,null,0]
["    Sainte-Sophie",0,0,10000,0.55558628318584069,0,0,8000,0.44441371681415931,0,0,18100,0,0,18100,null,0,null,5.5558628318584068E-3,null,0,null,4.4441371681415934E-3,null,0,null,null,0]
["    Saint-Hippolyte",1300,0.12287937013778234,8500,0.79838785265723122,0,0,800,7.8732777204986407E-2,0,0,10700,0,0,10700,null,1.2287937013778234E-3,null,7.9838785265723116E-3,null,0,null,7.8732777204986403E-4,null,0,null,null,0]
["    Saint-Jérôme",1800,2.2178449877201949E-2,31700,0.39497338336678595,17000,0.21176118584269382,11800,0.14652238415219479,15200,0.18892199518781244,77400,2900,3.5642601573311061E-2,80200,null,2.217844987720195E-4,null,3.9497338336678591E-3,null,2.1176118584269382E-3,null,1.4652238415219479E-3,null,1.8892199518781244E-3,null,null,3.5642601573311063E-4]
["MRC Argenteuil",2000,5.766574585635359E-2,18600,0.53409875690607733,4100,0.11869820441988949,4000,0.11648250460405157,4500,0.13038098526703498,33300,1500,4.2673802946592995E-2,34800,null,5.7665745856353594E-4,null,5.3409875690607735E-3,null,1.1869820441988948E-3,null,1.1648250460405158E-3,null,1.3038098526703499E-3,null,null,4.2673802946592993E-4]
["    Brownsburg-Chatham",0,0,4800,0.66165309783358628,600,8.1688974748171661E-2,1900,0.256657927418242,0,0,7200,0,0,7200,null,0,null,6.6165309783358627E-3,null,8.1688974748171661E-4,null,2.5665792741824201E-3,null,0,null,null,0]
["    Gore",1100,0.49671484888304862,1100,0.50328515111695138,0,0,0,0,0,0,2300,0,0,2300,null,4.9671484888304859E-3,null,5.0328515111695135E-3,null,0,null,0,null,0,null,null,0]
["    Grenville",0,0,0,0,1800,1,0,0,0,0,1800,0,0,1800,null,0,null,0,null,0.01,null,0,null,0,null,null,0]
["    Grenville-sur-la-Rouge",0,0,2200,0.7755809920221991,0,0,600,0.2244190079778009,0,0,2900,0,0,2900,null,0,null,7.7558099202219913E-3,null,0,null,2.2441900797780089E-3,null,0,null,null,0]
["    Harrington",0,0,1000,1,0,0,0,0,0,0,1000,0,0,1000,null,0,null,0.01,null,0,null,0,null,0,null,null,0]
["    Lachute",0,0,4800,0.34241134751773056,1700,0.12177304964539007,1500,0.10929078014184396,4500,0.32134751773049641,12600,1500,0.105177304964539,14100,null,0,null,3.4241134751773054E-3,null,1.2177304964539008E-3,null,1.0929078014184396E-3,null,3.213475177304964E-3,null,null,1.05177304964539E-3]
["    Mille-Isles",900,0.50552004648460203,900,0.49447995351539803,0,0,0,0,0,0,1700,0,0,1700,null,5.0552004648460203E-3,null,4.9447995351539799E-3,null,0,null,0,null,0,null,null,0]
["    Saint-André-d'Argenteuil",0,0,3100,1,0,0,0,0,0,0,3100,0,0,3100,null,0,null,0.01,null,0,null,0,null,0,null,null,0]
["    Wentworth",0,0,700,1,0,0,0,0,0,0,700,0,0,700,null,0,null,0.01,null,0,null,0,null,0,null,null,0]
["MRC Les Pays-d'en-Haut",1000,2.1833589139410709E-2,23400,0.50597721524460104,10200,0.22090836377785944,9600,0.20772174063425497,2000,4.3342917053978684E-2,46200,0,2.1617414989515555E-4,46300,null,2.183358913941071E-4,null,5.0597721524460104E-3,null,2.2090836377785944E-3,null,2.0772174063425496E-3,null,4.3342917053978687E-4,null,null,2.1617414989515555E-6]
["    Estérel",300,1,0,0,0,0,0,0,0,0,300,0,0,300,null,0.01,null,0,null,0,null,0,null,0,null,null,0]
["    Lac-des-Seize-îles",0,0,200,1,0,0,0,0,0,0,200,0,0,200,null,0,null,0.01,null,0,null,0,null,0,null,null,0]
["    Morin-Heights",0,0,4700,1,0,0,0,0,0,0,4700,0,0,4700,null,0,null,0.01,null,0,null,0,null,0,null,null,0]
["    Piedmont",0,0,800,0.23388952819332565,2700,0.76611047180667446,0,0,0,0,3500,0,0,3500,null,0,null,2.3388952819332564E-3,null,7.6611047180667443E-3,null,0,null,0,null,null,0]
["    Saint-Adolphe-d'Howard",0,0,1600,0.40873430962343094,0,0,2300,0.59126569037656906,0,0,3800,0,0,3800,null,0,null,4.0873430962343089E-3,null,0,null,5.9126569037656904E-3,null,0,null,null,0]
["    Sainte-Adèle",0,0,5300,0.38144182726623838,4600,0.32798001427551748,2100,0.14746609564596716,2000,0.14311206281227695,14000,0,0,14000,null,0,null,3.814418272662384E-3,null,3.2798001427551747E-3,null,1.4746609564596717E-3,null,1.4311206281227694E-3,null,null,0]
["    Sainte-Anne-des-Lacs",700,0.23265940902021773,2500,0.76734059097978213,0,0,0,0,0,0,3200,0,0,3200,null,2.3265940902021773E-3,null,7.6734059097978216E-3,null,0,null,0,null,0,null,null,0]
["    Sainte-Marguerite-du-Lac-Masson",0,0,0,0,0,0,3400,0.99702999702999706,0,0,3400,0,2.9700029700029701E-3,3400,null,0,null,0,null,0,null,9.9702999702999708E-3,null,0,null,null,2.9700029700029701E-5]
["    Saint-Sauveur",0,0,7400,0.64093264248704651,3000,0.25569948186528496,1200,0.10336787564766839,0,0,11600,0,0,11600,null,0,null,6.4093264248704651E-3,null,2.5569948186528494E-3,null,1.0336787564766839E-3,null,0,null,null,0]
["    Wentworth-Nord",0,0,900,0.56459330143540665,0,0,700,0.4354066985645933,0,0,1700,0,0,1700,null,0,null,5.6459330143540662E-3,null,0,null,4.3540669856459331E-3,null,0,null,null,0]
["MRC Les Laurentides",2300,4.5217322803631568E-2,24900,0.49073399373732202,8900,0.17555192311479606,9200,0.1821493983496465,3500,6.8278945191720661E-2,48800,1900,3.8068416802883198E-2,50800,null,4.5217322803631568E-4,null,4.90733993737322E-3,null,1.7555192311479607E-3,null,1.821493983496465E-3,null,6.8278945191720662E-4,null,null,3.8068416802883201E-4]
["    Amherst",0,0,0,0,0,0,1700,1,0,0,1700,0,0,1700,null,0,null,0,null,0,null,0.01,null,0,null,null,0]
["    Arundel",0,0,0,0,600,1,0,0,0,0,600,0,0,600,null,0,null,0,null,0.01,null,0,null,0,null,null,0]
["    Barkmere",0,0,0,0,0,0,0,0,0,0,0,100,1,100,null,0,null,0,null,0,null,0,null,0,null,null,0.01]
["    Brébeuf",0,0,1000,1,0,0,0,0,0,0,1000,0,0,1000,null,0,null,0.01,null,0,null,0,null,0,null,null,0]
["    Huberdeau",0,0,500,0.5330243337195828,0,0,400,0.46697566628041715,0,0,900,0,0,900,null,0,null,5.3302433371958278E-3,null,0,null,4.6697566628041715E-3,null,0,null,null,0]
["    Ivry-sur-le-Lac",400,1,0,0,0,0,0,0,0,0,400,0,0,400,null,0.01,null,0,null,0,null,0,null,0,null,null,0]
["    La Conception",0,0,600,0.37851997380484614,0,0,900,0.62148002619515386,0,0,1500,0,0,1500,null,0,null,3.7851997380484613E-3,null,0,null,6.2148002619515389E-3,null,0,null,null,0]
["    La Minerve",0,0,1400,1,0,0,0,0,0,0,1400,0,0,1400,null,0,null,0.01,null,0,null,0,null,0,null,null,0]
["    Labelle",0,0,1700,0.60433996383363475,0,0,1100,0.3956600361663653,0,0,2800,0,0,2800,null,0,null,6.0433996383363478E-3,null,0,null,3.9566003616636532E-3,null,0,null,null,0]
["    Lac-Supérieur",0,0,1300,0.66430020283975655,0,0,700,0.3356997971602434,0,0,2000,0,0,2000,null,0,null,6.6430020283975658E-3,null,0,null,3.3569979716024339E-3,null,0,null,null,0]
["    Lac-Tremblant-Nord",0,0,0,0,0,0,0,0,0,0,0,100,1,100,null,0,null,0,null,0,null,0,null,0,null,null,0.01]
["    Lantier",0,0,0,0,0,0,900,1,0,0,900,0,0,900,null,0,null,0,null,0,null,0.01,null,0,null,null,0]
["    Montcalm",0,0,600,1,0,0,0,0,0,0,600,0,0,600,null,0,null,0.01,null,0,null,0,null,0,null,null,0]
["    Mont-Tremblant",1900,0.17330786026200873,3300,0.30349344978165937,3100,0.28575327510917031,500,4.475982532751091E-2,1000,8.6881368267831147E-2,9800,1200,0.1058042212518195,11000,null,1.7330786026200874E-3,null,3.0349344978165939E-3,null,2.857532751091703E-3,null,4.4759825327510912E-4,null,8.6881368267831141E-4,null,null,1.058042212518195E-3]
["    Sainte-Agathe-des-Monts",0,0,4900,0.43938988493443937,1400,0.12113103202212114,1800,0.1593078226741593,2500,0.2240656498082241,10600,600,5.6105610561056105E-2,11200,null,0,null,4.3938988493443937E-3,null,1.2113103202212115E-3,null,1.5930782267415929E-3,null,2.240656498082241E-3,null,null,5.6105610561056108E-4]
["    Sainte-Lucie-des-Laurentides",0,0,700,0.46228373702422149,0,0,800,0.53771626297577857,0,0,1400,0,0,1400,null,0,null,4.6228373702422148E-3,null,0,null,5.3771626297577854E-3,null,0,null,null,0]
["    Mont-Blanc",0,0,2700,0.72724867724867726,600,0.1492063492063492,500,0.12354497354497354,0,0,3800,0,0,3800,null,0,null,7.2724867724867723E-3,null,1.492063492063492E-3,null,1.2354497354497354E-3,null,0,null,null,0]
["    Val-David",0,0,3000,0.53976250449802088,2600,0.46023749550197912,0,0,0,0,5600,0,0,5600,null,0,null,5.3976250449802084E-3,null,4.6023749550197909E-3,null,0,null,0,null,null,0]
["    Val-des-Lacs",0,0,800,1,0,0,0,0,0,0,800,0,0,800,null,0,null,0.01,null,0,null,0,null,0,null,null,0]
["    Val-Morin",0,0,2400,0.77105347422350301,700,0.22894652577649699,0,0,0,0,3100,0,0,3100,null,{"$f":"C72/100","v":0},null,{"$f":"E72/100","v":7.7105347422350302E-3},null,{"$f":"G72/100","v":2.28946525776497E-3},null,{"$f":"I72/100","v":0},null,{"$f":"K72/100","v":0},null,null,{"$f":"N72/100","v":0}]
["MRC Antoine-Labelle",1800,5.019612145815619E-2,18100,0.49776448967276515,5100,0.14115259072331787,5000,0.13733987985846338,3700,0.10176372164467729,33800,2600,7.1783196642620076E-2,36500,null,5.0196121458156192E-4,null,4.9776448967276512E-3,null,1.4115259072331786E-3,null,1.3733987985846338E-3,null,1.0176372164467729E-3,null,null,7.1783196642620072E-4]
["    Chute-Saint-Philippe",0,0,500,0.44947064485081811,0,0,600,0.55052935514918189,0,0,1000,0,0,1000,null,0,null,4.4947064485081813E-3,null,0,null,5.5052935514918189E-3,null,0,null,null,0]
["    Ferme-Neuve",0,0,1500,0.54786450662739328,0,0,800,0.2923416789396171,400,0.15979381443298968,2700,0,0,2700,null,0,null,5.4786450662739324E-3,null,0,null,2.9234167893961711E-3,null,1.5979381443298967E-3,null,null,0]
["    Kiamika",0,0,800,1,0,0,0,0,0,0,800,0,0,800,null,0,null,0.01,null,0,null,0,null,0,null,null,0]
["    La Macaza",0,0,0,0,500,0.41590493601462525,0,0,0,0,500,600,0.58409506398537481,1100,null,0,null,0,null,4.1590493601462528E-3,null,0,null,0,null,null,5.8409506398537482E-3]
["    Lac-des-Écorces",0,0,800,0.29081455805892548,1000,0.34107452339688044,500,0.18162911611785096,500,0.18648180242634316,2900,0,0,2900,null,0,null,2.9081455805892546E-3,null,3.4107452339688041E-3,null,1.8162911611785096E-3,null,1.8648180242634316E-3,null,null,0]
["    Lac-du-Cerf",0,0,0,0,0,0,400,1,0,0,400,0,0,400,null,0,null,0,null,0,null,0.01,null,0,null,null,0]
["    Lac-Saguay",0,0,500,1,0,0,0,0,0,0,500,0,0,500,null,0,null,0.01,null,0,null,0,null,0,null,null,0]
["    Lac-Saint-Paul",0,0,500,1,0,0,0,0,0,0,500,0,0,500,null,0,null,0.01,null,0,null,0,null,0,null,null,0]
["    L'Ascension",0,0,400,0.43937708565072309,0,0,500,0.56062291434927702,0,0,900,0,0,900,null,0,null,4.3937708565072306E-3,null,0,null,5.6062291434927705E-3,null,0,null,null,0]
["    Mont-Laurier",1000,7.0874471086036672E-2,6700,0.47009873060648799,2200,0.1581805359661495,800,5.6205923836389282E-2,1500,0.10514809590973202,12200,2000,0.13949224259520451,14200,null,7.0874471086036675E-4,null,4.7009873060648803E-3,null,1.581805359661495E-3,null,5.6205923836389281E-4,null,1.0514809590973203E-3,null,null,1.3949224259520452E-3]
["    Mont-Saint-Michel",0,0,0,0,0,0,600,1,0,0,600,0,0,600,null,0,null,0,null,0,null,0.01,null,0,null,null,0]
["    Nominingue",0,0,1900,0.85277161862527717,0,0,0,0,300,0.14722838137472283,2300,0,0,2300,null,0,null,8.5277161862527713E-3,null,0,null,0,null,1.4722838137472282E-3,null,null,0]
["    Notre-Dame-de-Pontmain",0,0,0,0,0,0,800,1,0,0,800,0,0,800,null,0,null,0,null,0,null,0.01,null,0,null,null,0]
["    Notre-Dame-du-Laus",0,0,1700,1,0,0,0,0,0,0,1700,0,0,1700,null,0,null,0.01,null,0,null,0,null,0,null,null,0]
["    Rivière-Rouge",800,0.17814726840855108,2000,0.42820125242928092,900,0.1960699632908659,0,0,900,0.1975815158713021,4600,0,0,4600,null,1.7814726840855108E-3,null,4.2820125242928088E-3,null,1.9606996329086589E-3,null,0,null,1.9758151587130211E-3,null,null,0]
["    Saint-Aimé-du-Lac-des-îles",0,0,800,1,0,0,0,0,0,0,800,0,0,800,null,0,null,0.01,null,0,null,0,null,0,null,null,0]
["    Sainte-Anne-du-Lac",0,0,0,0,600,1,0,0,0,0,600,0,0,600,null,0,null,0,null,0.01,null,0,null,0,null,null,0]
["   Territoires non organisés","ND","ND","ND","ND","ND","ND","ND","ND","ND","ND","ND","ND","ND","ND"]
[]
["Défavorisation matérielle 2021 MRC  ---- RÉGIONAL ----"]
["Répartition de la population (N, %) par quintile de défavorisation matérielle 2021\nRégion des Laurentides (variation régionale 2021)"]
[null,"Conditions\nplus favorables",null,null,null,null,null,null,null,"Conditions\nplus défavorables",null,"Population avec indice","Population\nsans indice",null,"Population totale"]
[null,"Quintile 1",null,"Quintile 2",null,"Quintile 3",null,"Quintile 4",null,"Quintile 5"]
[null,"N","%","N","%","N","%",null,null,null,null,"N","N","%","N"]
[null,null,null,null,null,null,null,null,null,null,null,null,null,null,null,null,0.12700726929237341,null,0.26181773378783524,null,0.28974495872520434,null,0.16900078031952032,null,0.15247032732350405,null,null,6.9999999999999993E-3]
[null,null,null,null,null,null,null,null,null,null,null,null,null,null,null,null,0.16865713095403417,null,0.19254270240244412,null,0.31703930009720871,null,0.15738554830347637,null,0.16437531824283663,null,null,1.8223959280130885E-2]
[null,null,null,null,null,null,null,null,null,null,null,null,null,null,null,null,0.26434613625971648,null,0.35413808870599001,null,0.27011888431641518,null,8.3047553726566067E-2,null,2.8349336991312299E-2,null,null,0]
[null,null,null,null,null,null,null,null,null,null,null,null,null,null,null,null,0,null,0.52611486112647998,null,0.18025893548744051,null,0.19558481797056543,null,9.8041385415513993E-2,null,null,0]
[null,null,null,null,null,null,null,null,null,null,null,null,null,null,null,null,0,null,0,null,7.2650902302426879E-2,null,0.23459863098942127,null,0.69275046670815188,null,null,0]
[null,null,null,null,null,null,null,null,null,null,null,null,null,null,null,null,0,null,0.22132495887542994,null,0.57006131299536411,null,0.20861372812920592,null,0,null,null,0]
[null,null,null,null,null,null,null,null,null,null,null,null,null,null,null,null,0.11861743912018854,null,0,null,0.41764859910971458,null,0.4637339617700969,null,0,null,null,1.307531380753138E-3]
[null,null,null,null,null,null,null,null,null,null,null,null,null,null,null,null,0,null,0,null,0.39383155397390274,null,0,null,0.60616844602609732,null,null,0]
[null,null,null,null,null,null,null,null,null,null,null,null,null,null,null,null,0.39,null,0.26300000000000001,null,0.126,null,0.12,null,0.1,null,null,5.0387325512561823E-2]
[null,null,null,null,null,null,null,null,null,null,null,null,null,null,null,null,0.3302707930367505,null,0.23378217527153697,null,0.18643059068590984,null,8.8454099092396946E-2,null,0.16106234191340574,null,null,0]
[null,null,null,null,null,null,null,null,null,null,null,null,null,null,null,null,0.26007651926327963,null,0.24130260699350475,null,0.12590088086128659,null,0.23485185514725507,null,0.13786813773467391,null,null,0.13509561737658241]
[null,null,null,null,null,null,null,null,null,null,null,null,null,null,null,null,0.39742861852347028,null,0.36107397300415739,null,0.11527261405468764,null,8.791047783007637E-2,null,3.8314316587608283E-2,null,null,3.9779821676661449E-2]
[null,null,null,null,null,null,null,null,null,null,null,null,null,null,null,null,0.83371858921780628,null,0.16628141078219372,null,0,null,0,null,0,null,null,3.9188995558102881E-2]
[null,null,null,null,null,null,null,null,null,null,null,null,null,null,null,null,0.80656544054747636,null,0.14863130881094952,null,4.4803250641573998E-2,null,0,null,0,null,null,0]
[null,null,null,null,null,null,null,null,null,null,null,null,null,null,null,null,0.32943574340270326,null,0.3532503754559107,null,0.15930057927483374,null,0.15801330186655224,null,0,null,null,3.2586135325861354E-2]
[null,null,null,null,null,null,null,null,null,null,null,null,null,null,null,null,0,null,6.5758429104193619E-2,null,0.21219270872973589,null,0.30626379480934623,null,0.41578506735672427,null,null,8.8898134664725056E-2]
[null,null,null,null,null,null,null,null,null,null,null,null,null,null,null,null,0.157,null,0.27500000000000002,null,0.314,null,0.22899999999999998,null,2.5000000000000001E-2,null,null,0]
[null,null,null,null,null,null,null,null,null,null,null,null,null,null,null,null,0.157,null,0.27500000000000002,null,0.314,null,0.22899999999999998,null,2.5000000000000001E-2,null,null,0]
[null,null,null,null,null,null,null,null,null,null,null,null,null,null,null,null,9.9864046471387968E-2,null,0.16973592057018083,null,0.23079141432867792,null,0.30437111193507188,null,0.195196308655708,null,null,4.2000000000000003E-2]
[null,null,null,null,null,null,null,null,null,null,null,null,null,null,null,null,0,null,0.23,null,0.45,null,0.32,null,0,null,null,0]
[null,null,null,null,null,null,null,null,null,null,null,null,null,null,null,null,9.7718422883877942E-2,null,0.13500000000000001,null,0.191,null,0.29299999999999998,null,0.28300000000000003,null,null,9.1531487907890133E-2]
[null,null,null,null,null,null,null,null,null,null,null,null,null,null,null,null,0,null,9.6000000000000002E-2,null,6.9000000000000006E-2,null,0.58899999999999997,null,0.24600000000000002,null,null,0]
[null,null,null,null,null,null,null,null,null,null,null,null,null,null,null,null,0.35871404399323181,null,0.3,null,0.24399999999999999,null,4.5999999999999999E-2,null,5.2999999999999999E-2,null,null,0]
[null,null,null,null,null,null,null,null,null,null,null,null,null,null,null,null,9.3822012509601663E-2,null,0.26300000000000001,null,0.40500000000000003,null,0.23899999999999999,null,0,null,null,0]
[null,null,null,null,null,null,null,null,null,null,null,null,null,null,null,null,0,null,1.7000000000000001E-2,null,9.9000000000000005E-2,null,0.33399999999999996,null,0.54899999999999993,null,null,3.5444132267127726E-2]
[null,null,null,null,null,null,null,null,null,null,null,null,null,null,null,null,0,null,0,null,0,null,0.45430463576158941,null,0.54569536423841059,null,null,0]
[null,null,null,null,null,null,null,null,null,null,null,null,null,null,null,null,0,null,0,null,0,null,0.31927607990438789,null,0.68072392009561211,null,null,8.9255170269009476E-2]
[null,null,null,null,null,null,null,null,null,null,null,null,null,null,null,null,0,null,0,null,0.47006302521008403,null,0,null,0.52993697478991597,null,null,0]
[null,null,null,null,null,null,null,null,null,null,null,null,null,null,null,null,0,null,0,null,0.52201659221442243,null,0.47798340778557752,null,0,null,null,0]
[null,null,null,null,null,null,null,null,null,null,null,null,null,null,null,null,0,null,1,null,0,null,0,null,0,null,null,0]
[null,null,null,null,null,null,null,null,null,null,null,null,null,null,null,null,0,null,0,null,9.4636338107273232E-2,null,0.36141533277169335,null,0.54394832912103341,null,null,0]
[null,null,null,null,null,null,null,null,null,null,null,null,null,null,null,null,0,null,0,null,0,null,0.41218130311614731,null,0.58781869688385269,null,null,0]
[null,null,null,null,null,null,null,null,null,null,null,null,null,null,null,null,0,null,0,null,0.41554646405610751,null,0,null,0.58445353594389249,null,null,0]
[null,null,null,null,null,null,null,null,null,null,null,null,null,null,null,null,0,null,0,null,0,null,1,null,0,null,null,0]
[null,null,null,null,null,null,null,null,null,null,null,null,null,null,null,null,0.42799999999999999,null,0.22500000000000001,null,0.185,null,9.6999999999999989E-2,null,6.5000000000000002E-2,null,null,2.106168063614872E-2]
[null,null,null,null,null,null,null,null,null,null,null,null,null,null,null,null,0,null,1,null,0,null,0,null,0,null,null,0]
[null,null,null,null,null,null,null,null,null,null,null,null,null,null,null,null,0,null,0,null,0.53541590991645482,null,0,null,0.46458409008354523,null,null,3.619254433586681E-3]
[null,null,null,null,null,null,null,null,null,null,null,null,null,null,null,null,0.14118739840544933,null,0.35203963155042961,null,0.21541915008901619,null,0.24909048687978946,null,4.2263333075315428E-2,null,null,0]
[null,null,null,null,null,null,null,null,null,null,null,null,null,null,null,null,1,null,0,null,0,null,0,null,0,null,null,0]
[null,null,null,null,null,null,null,null,null,null,null,null,null,null,null,null,0.79562448075325387,null,0.20437551924674605,null,0,null,0,null,0,null,null,0]
[null,null,null,null,null,null,null,null,null,null,null,null,null,null,null,null,0.70370766107490113,null,0.23421305695052891,null,6.2079281974569932E-2,null,0,null,0,null,null,8.5231160199393988E-2]
[null,null,null,null,null,null,null,null,null,null,null,null,null,null,null,null,0.45983112183353436,null,0.20530759951749095,null,0.33486127864897469,null,0,null,0,null,null,0]
[null,null,null,null,null,null,null,null,null,null,null,null,null,null,null,null,0,null,0,null,0,null,0,null,1,null,null,0]
[null,null,null,null,null,null,null,null,null,null,null,null,null,null,null,null,0,null,0.51629254163649529,null,0,null,0,null,0.48370745836350471,null,null,0]
[null,null,null,null,null,null,null,null,null,null,null,null,null,null,null,null,0.39925904816186952,null,0,null,0.38757480763750357,null,0.21316614420062696,null,0,null,null,0]
[null,null,null,null,null,null,null,null,null,null,null,null,null,null,null,null,0.10734608208955225,null,8.4000000000000005E-2,null,0.21,null,0.25900000000000001,null,0.33899999999999997,null,null,6.6000000000000003E-2]
[null,null,null,null,null,null,null,null,null,null,null,null,null,null,null,null,0,null,0,null,0.52787456445993031,null,0.47212543554006969,null,0,null,null,0]
[null,null,null,null,null,null,null,null,null,null,null,null,null,null,null,null,0.14073622127313404,null,0.22493390278625178,null,0.4077689648159446,null,0.2265609111246695,null,0,null,null,0]
[null,null,null,null,null,null,null,null,null,null,null,null,null,null,null,null,0,null,0,null,0,null,0,null,1,null,null,0]
[null,null,null,null,null,null,null,null,null,null,null,null,null,null,null,null,0,null,0,null,0,null,0,null,1,null,null,0]
[null,null,null,null,null,null,null,null,null,null,null,null,null,null,null,null,0.15097125979779621,null,0,null,0.12779734181529023,null,0.19050323753265933,null,0.53072816085425423,null,null,0.13890247481169912]
[null,null,null,null,null,null,null,null,null,null,null,null,null,null,null,null,0,null,0,null,1,null,0,null,0,null,null,0]
[null,null,null,null,null,null,null,null,null,null,null,null,null,null,null,null,0.13918262360674477,null,0,null,0,null,0.72849385538725353,null,0.13232352100600173,null,null,0]
[null,null,null,null,null,null,null,null,null,null,null,null,null,null,null,null,0,null,0,null,1,null,0,null,0,null,null,0]
[null,null,null,null,null,null,null,null,null,null,null,null,null,null,null,null,0,null,0,null,0,null,0,null,1,null,null,0]
[null,null,null,null,null,null,null,null,null,null,null,null,null,null,null,null,1,null,0,null,0,null,0,null,0,null,null,0]
[null,null,null,null,null,null,null,null,null,null,null,null,null,null,null,null,0,null,0,null,0,null,1,null,0,null,null,0]
[null,null,null,null,null,null,null,null,null,null,null,null,null,null,null,null,0,null,0,null,0,null,0,null,1,null,null,0]
[null,null,null,null,null,null,null,null,null,null,null,null,null,null,null,null,0,null,0,null,0.41598360655737709,null,0,null,0.58401639344262291,null,null,0]
[null,null,null,null,null,null,null,null,null,null,null,null,null,null,null,null,0,null,0.2701271186440678,null,0.7298728813559322,null,0,null,0,null,null,0]
[null,null,null,null,null,null,null,null,null,null,null,null,null,null,null,null,0,null,0,null,0,null,0,null,1,null,null,0]
[null,null,null,null,null,null,null,null,null,null,null,null,null,null,null,null,0.19045251118846346,null,0.17217802088513179,null,9.087518647439087E-2,null,0.34124813525609149,null,0.20524614619592241,null,null,0.16607920381505287]
[null,null,null,null,null,null,null,null,null,null,null,null,null,null,null,null,0,null,0.41810022438294697,null,0.58189977561705308,null,0,null,0,null,null,0]
[null,null,null,null,null,null,null,null,null,null,null,null,null,null,null,null,0,null,0,null,0.25353249899071456,null,0.32377876463463873,null,0.42268873637464677,null,null,0]
[null,null,null,null,null,null,null,null,null,null,null,null,null,null,null,null,0,null,1,null,0,null,0,null,0,null,null,0]
[null,null,null,null,null,null,null,null,null,null,null,null,null,null,null,null,0,null,0,null,0,null,0,null,1,null,null,0]
[null,null,null,null,null,null,null,null,null,null,null,null,null,null,null,null,0,null,1.7000000000000001E-2,null,7.6999999999999999E-2,null,0.14899999999999999,null,0.75800000000000001,null,null,8.3903186448372746E-2]
[null,null,null,null,null,null,null,null,null,null,null,null,null,null,null,null,0,null,0,null,0,null,0,null,1,null,null,0]
[null,null,null,null,null,null,null,null,null,null,null,null,null,null,null,null,0,null,0,null,0,null,0,null,1,null,null,0]
[null,null,null,null,null,null,null,null,null,null,null,null,null,null,null,null,0,null,0,null,0,null,0,null,1,null,null,0]
[null,null,null,null,null,null,null,null,null,null,null,null,null,null,null,null,0,null,0,null,0,null,0,null,1,null,null,0]
[null,null,null,null,null,null,null,null,null,null,null,null,null,null,null,null,0,null,0,null,0,null,0,null,1,null,null,0]
[null,null,null,null,null,null,null,null,null,null,null,null,null,null,null,null,0,null,0,null,0.28685072531586336,null,0.16612072999532054,null,0.54702854468881612,null,null,0]
[null,null,null,null,null,null,null,null,null,null,null,null,null,null,null,null,0,null,0,null,0.16728366496992134,null,0.12656177695511336,null,0.7061545580749653,null,null,0]
[null,null,null,null,null,null,null,null,null,null,null,null,null,null,null,null,0,null,0,null,0,null,1,null,0,null,null,0.61799999999999999]
[null,null,null,null,null,null,null,null,null,null,null,null,null,null,null,null,0,null,0,null,0,null,0,null,1,null,null,0]
[null,null,null,null,null,null,null,null,null,null,null,null,null,null,null,null,0,null,0,null,0,null,0,null,1,null,null,0]
[null,null,null,null,null,null,null,null,null,null,null,null,null,null,null,null,0,null,0,null,0,null,0.4713375796178344,null,0.5286624203821656,null,null,0]
[null,null,null,null,null,null,null,null,null,null,null,null,null,null,null,null,0,null,0,null,0.25164594001463059,null,0,null,0.74835405998536941,null,null,0]
[null,null,null,null,null,null,null,null,null,null,null,null,null,null,null,null,0,null,4.5305263157894737E-2,null,3.8821052631578951E-2,null,0.25355789473684209,null,0.66231578947368419,null,null,0.159]
[null,null,null,null,null,null,null,null,null,null,null,null,null,null,null,null,0,null,0,null,0,null,0,null,1,null,null,0]
[null,null,null,null,null,null,null,null,null,null,null,null,null,null,null,null,0,null,0,null,0,null,0,null,1,null,null,0]
[null,null,null,null,null,null,null,null,null,null,null,null,null,null,null,null,0,null,0,null,0,null,0,null,1,null,null,0]
[null,null,null,null,null,null,null,null,null,null,null,null,null,null,null,null,0,null,0,null,0,null,0,null,1,null,null,0]
[null,null,null,null,null,null,null,null,null,null,null,null,null,null,null,null,0,null,0,null,0,null,0,null,0,null,null,1]
[]
["Défavorisation sociale 2021 MRC  ---- RÉGIONAL ----"]
["Répartition de la population (N, %) par quintile de défavorisation sociale 2021\nRégion des Laurentides (variation régionale 2021)"]
[null,"Conditions\nplus favorables",null,null,null,null,null,null,null,"Conditions\nplus défavorables",null,"Population avec indice","Population\nsans indice",null,"Population totale"]
[null,"Quintile 1",null,"Quintile 2",null,"Quintile 3",null,"Quintile 4",null,"Quintile 5"]
[null,"N","%","N","%","N","%",null,null,null,null,"N","N","%","N"]
[null,null,null,null,null,null,null,null,null,null,null,null,null,null,null,null,0.25052363546757567,null,0.20362232535217051,null,0.21115856914041642,null,0.14258285761222228,null,0.19214341451394307,null,null,6.9999999999999993E-3]
[null,null,null,null,null,null,null,null,null,null,null,null,null,null,null,null,0.33299999999999996,null,9.0999999999999998E-2,null,0.15,null,0.17199999999999999,null,0.253,null,null,1.8223959280130885E-2]
[null,null,null,null,null,null,null,null,null,null,null,null,null,null,null,null,0.14800000000000002,null,0.16699999999999998,null,0.158,null,0.22399999999999998,null,0.30199999999999999,null,null,0]
[null,null,null,null,null,null,null,null,null,null,null,null,null,null,null,null,9.6000000000000002E-2,null,0.45,null,0.38700000000000001,null,4.5999999999999999E-2,null,2.1000000000000001E-2,null,null,0]
[null,null,null,null,null,null,null,null,null,null,null,null,null,null,null,null,0.16,null,0.35499999999999998,null,8.4000000000000005E-2,null,7.400000000000001E-2,null,0.32700000000000001,null,null,0]
[null,null,null,null,null,null,null,null,null,null,null,null,null,null,null,null,0.53200000000000003,null,0.14400000000000002,null,0.32400000000000001,null,0,null,0,null,null,0]
[null,null,null,null,null,null,null,null,null,null,null,null,null,null,null,null,0.16500000000000001,null,0.41700000000000004,null,0.41799999999999998,null,0,null,0,null,null,1.307531380753138E-3]
[null,null,null,null,null,null,null,null,null,null,null,null,null,null,null,null,0.27899999999999997,null,0,null,0,null,0.72099999999999997,null,0,null,null,0]
[null,null,null,null,null,null,null,null,null,null,null,null,null,null,null,null,0.29705001105994489,null,0.16429045426210059,null,0.14548854792977942,null,0.15947099948386922,null,0.23369998726430588,null,null,5.0387325512561823E-2]
[null,null,null,null,null,null,null,null,null,null,null,null,null,null,null,null,0.19654813271834548,null,0.19840797500371965,null,0.17196101770569855,null,0.17776372563606607,null,0.25531914893617019,null,null,0]
[null,null,null,null,null,null,null,null,null,null,null,null,null,null,null,null,9.1734140048046975E-2,null,6.8111041907643027E-2,null,4.4621407598540802E-2,null,0.15455111664738855,null,0.64098229379838079,null,null,0.13509561737658241]
[null,null,null,null,null,null,null,null,null,null,null,null,null,null,null,null,0.3201589714474094,null,0.2238237394919507,null,0.13221369571985861,null,0.20292668632442626,null,0.12087690701635501,null,null,3.9779821676661449E-2]
[null,null,null,null,null,null,null,null,null,null,null,null,null,null,null,null,0.49049287897994182,null,8.8658563865483556E-2,null,0.14145104764745359,null,0.18343151144582806,null,9.5965998061292968E-2,null,null,3.9188995558102881E-2]
[null,null,null,null,null,null,null,null,null,null,null,null,null,null,null,null,0.68316937553464496,null,0.19493156544054749,null,7.7202737382378095E-2,null,4.4696321642429426E-2,null,0,null,null,0]
[null,null,null,null,null,null,null,null,null,null,null,null,null,null,null,null,5.524565543874705E-2,null,0.10469856254022741,null,0.16123149538725595,null,0.16949152542372878,null,0.50933276121004079,null,null,3.2586135325861354E-2]
[null,null,null,null,null,null,null,null,null,null,null,null,null,null,null,null,0.45718852271862398,null,0.10929294466854403,null,0.36060582997183954,null,0,null,7.2912702640992463E-2,null,null,8.8898134664725056E-2]
[null,null,null,null,null,null,null,null,null,null,null,null,null,null,null,null,6.2162215667253974E-2,null,0.23908696771128224,null,0.33235008809613364,null,0.27507770276958404,null,9.1323025755746065E-2,null,null,0]
[null,null,null,null,null,null,null,null,null,null,null,null,null,null,null,null,6.2162215667253974E-2,null,0.23908696771128224,null,0.33235008809613364,null,0.27507770276958404,null,9.1323025755746065E-2,null,null,0]
[null,null,null,null,null,null,null,null,null,null,null,null,null,null,null,null,0.18209533226218433,null,0.20457298232604126,null,0.17393812054546204,null,0.17455609113006221,null,0.26482923412845549,null,null,4.1129505055816452E-2]
[null,null,null,null,null,null,null,null,null,null,null,null,null,null,null,null,0.40464448467444908,null,0.34700000000000003,null,8.6999999999999994E-2,null,0.16200000000000001,null,0,null,null,0]
[null,null,null,null,null,null,null,null,null,null,null,null,null,null,null,null,0.15218904073081535,null,0.105,null,0.13100000000000001,null,0.16899999999999998,null,0.44400000000000001,null,null,9.1531487907890133E-2]
[null,null,null,null,null,null,null,null,null,null,null,null,null,null,null,null,0.20325047801147228,null,0.24600000000000002,null,0.38500000000000001,null,0.16500000000000001,null,0,null,null,0]
[null,null,null,null,null,null,null,null,null,null,null,null,null,null,null,null,0.1654360867558837,null,0.36399999999999999,null,0.19899999999999998,null,0.10300000000000001,null,0.16800000000000001,null,null,0]
[null,null,null,null,null,null,null,null,null,null,null,null,null,null,null,null,0,null,0.39600000000000002,null,0.248,null,0.35600000000000004,null,0,null,null,0]
[null,null,null,null,null,null,null,null,null,null,null,null,null,null,null,null,7.9000000000000001E-2,null,0.33899999999999997,null,0.218,null,0.21600000000000003,null,0.13300000000000001,null,null,3.5000000000000003E-2]
[null,null,null,null,null,null,null,null,null,null,null,null,null,null,null,null,0.16986754966887418,null,0.20132450331125828,null,0.62880794701986753,null,0,null,0,null,null,0]
[null,null,null,null,null,null,null,null,null,null,null,null,null,null,null,null,0,null,0.23254225712822263,null,3.8586306983097146E-2,null,0.49009731944681578,null,0.23877411644186444,null,null,8.900000000000001E-2]
[null,null,null,null,null,null,null,null,null,null,null,null,null,null,null,null,0.52993697478991597,null,0.47006302521008403,null,0,null,0,null,0,null,null,0]
[null,null,null,null,null,null,null,null,null,null,null,null,null,null,null,null,0,null,1,null,0,null,0,null,0,null,null,0]
[null,null,null,null,null,null,null,null,null,null,null,null,null,null,null,null,0,null,1,null,0,null,0,null,0,null,null,0]
[null,null,null,null,null,null,null,null,null,null,null,null,null,null,null,null,6.3886548722269024E-2,null,0.29752878404942434,null,0.54689693906206127,null,0,null,9.168772816624543E-2,null,null,0]
[null,null,null,null,null,null,null,null,null,null,null,null,null,null,null,null,0.20538243626062322,null,0.60021246458923516,null,0.19440509915014165,null,0,null,0,null,null,0]
[null,null,null,null,null,null,null,null,null,null,null,null,null,null,null,null,0,null,0,null,0,null,0.58445353594389249,null,0.41554646405610751,null,null,0]
[null,null,null,null,null,null,null,null,null,null,null,null,null,null,null,null,0,null,1,null,0,null,0,null,0,null,null,0]
[null,null,null,null,null,null,null,null,null,null,null,null,null,null,null,null,8.9767044761556291E-3,null,9.4E-2,null,0.22699999999999998,null,0.441,null,0.23,null,null,0.21061680636148719]
[null,null,null,null,null,null,null,null,null,null,null,null,null,null,null,null,1,null,0,null,0,null,0,null,0,null,null,0]
[null,null,null,null,null,null,null,null,null,null,null,null,null,null,null,null,0,null,0.30439520523065744,null,0,null,0.69560479476934267,null,0,null,null,3.619254433586681E-3]
[null,null,null,null,null,null,null,null,null,null,null,null,null,null,null,null,0,null,5.4725597956498187E-2,null,0.1843795959439585,null,0.41736976546172305,null,0.34352504063782019,null,null,0]
[null,null,null,null,null,null,null,null,null,null,null,null,null,null,null,null,0,null,0,null,0,null,0.3976271186440678,null,0.60237288135593225,null,null,0]
[null,null,null,null,null,null,null,null,null,null,null,null,null,null,null,null,0,null,0.16865134311824978,null,0.62918859041816666,null,0.20216006646358353,null,0,null,null,0]
[null,null,null,null,null,null,null,null,null,null,null,null,null,null,null,null,0,null,0,null,0.27663211881611283,null,0.46212202158350252,null,0.26124585960038466,null,null,8.5231160199393988E-2]
[null,null,null,null,null,null,null,null,null,null,null,null,null,null,null,null,0,null,0.23377563329312426,null,0.33486127864897469,null,0.43136308805790108,null,0,null,null,0]
[null,null,null,null,null,null,null,null,null,null,null,null,null,null,null,null,1,null,0,null,0,null,0,null,0,null,null,0]
[null,null,null,null,null,null,null,null,null,null,null,null,null,null,null,null,0,null,0,null,0.48370745836350471,null,0.51629254163649529,null,0,null,null,0]
[null,null,null,null,null,null,null,null,null,null,null,null,null,null,null,null,0,null,0.20632658877172982,null,0,null,0.58050726702764321,null,0.21316614420062696,null,null,0]
[null,null,null,null,null,null,null,null,null,null,null,null,null,null,null,null,7.698227611940299E-2,null,0.1863106343283582,null,0.2804570895522388,null,0.2883162313432836,null,0.16793376865671644,null,null,6.6000000000000003E-2]
[null,null,null,null,null,null,null,null,null,null,null,null,null,null,null,null,0,null,0,null,0.3073170731707317,null,0.69268292682926824,null,0,null,null,0]
[null,null,null,null,null,null,null,null,null,null,null,null,null,null,null,null,0,null,0,null,0.18954647142566608,null,0.36099247508643484,null,0.44946105348789911,null,null,0]
[null,null,null,null,null,null,null,null,null,null,null,null,null,null,null,null,0,null,0,null,1,null,0,null,0,null,null,0]
[null,null,null,null,null,null,null,null,null,null,null,null,null,null,null,null,0,null,0.48168789808917195,null,0.51831210191082799,null,0,null,0,null,null,0]
[null,null,null,null,null,null,null,null,null,null,null,null,null,null,null,null,8.9287742814949458E-2,null,5.3504487106668192E-2,null,0.17789389980688403,null,0.48710666818130188,null,0.19220720209019648,null,null,0.13890247481169912]
[null,null,null,null,null,null,null,null,null,null,null,null,null,null,null,null,0,null,1,null,0,null,0,null,0,null,null,0]
[null,null,null,null,null,null,null,null,null,null,null,null,null,null,null,null,0.21491854815661618,null,0.3669619891397542,null,0.27150614461274653,null,0,null,0.1466133180908831,null,null,0]
[null,null,null,null,null,null,null,null,null,null,null,null,null,null,null,null,0,null,0,null,0,null,0,null,1,null,null,0]
[null,null,null,null,null,null,null,null,null,null,null,null,null,null,null,null,1,null,0,null,0,null,0,null,0,null,null,0]
[null,null,null,null,null,null,null,null,null,null,null,null,null,null,null,null,0,null,0,null,0,null,0,null,1,null,null,0]
[null,null,null,null,null,null,null,null,null,null,null,null,null,null,null,null,0,null,0,null,0.54608294930875578,null,0.45391705069124422,null,0,null,null,0]
[null,null,null,null,null,null,null,null,null,null,null,null,null,null,null,null,0,null,0.56132075471698117,null,0,null,0.43867924528301894,null,0,null,null,0]
[null,null,null,null,null,null,null,null,null,null,null,null,null,null,null,null,0.58401639344262291,null,0.41598360655737709,null,0,null,0,null,0,null,null,0]
[null,null,null,null,null,null,null,null,null,null,null,null,null,null,null,null,0,null,0.6652542372881356,null,0.3347457627118644,null,0,null,0,null,null,0]
[null,null,null,null,null,null,null,null,null,null,null,null,null,null,null,null,0,null,1,null,0,null,0,null,0,null,null,0]
[null,null,null,null,null,null,null,null,null,null,null,null,null,null,null,null,0,null,6.7503729487817007E-2,null,0.38736946792640475,null,0.27598209845847838,null,0.26914470412729985,null,null,0.16607920381505287]
[null,null,null,null,null,null,null,null,null,null,null,null,null,null,null,null,0,null,0.58189977561705308,null,0.41810022438294697,null,0,null,0,null,null,0]
[null,null,null,null,null,null,null,null,null,null,null,null,null,null,null,null,0,null,0,null,0.57731126362535323,null,0.42268873637464677,null,0,null,null,0]
[null,null,null,null,null,null,null,null,null,null,null,null,null,null,null,null,1,null,0,null,0,null,0,null,0,null,null,0]
[null,null,null,null,null,null,null,null,null,null,null,null,null,null,null,null,0.43402489626556018,null,0.56597510373443982,null,0,null,0,null,0,null,null,0]
[null,null,null,null,null,null,null,null,null,null,null,null,null,null,null,null,0.39862479093105369,null,0.2790683268289661,null,0.13368023291829276,null,0.123149352660596,null,6.5477296661091491E-2,null,null,8.3903186448372746E-2]
[null,null,null,null,null,null,null,null,null,null,null,null,null,null,null,null,0.2952503209242619,null,0.70474967907573816,null,0,null,0,null,0,null,null,0]
[null,null,null,null,null,null,null,null,null,null,null,null,null,null,null,null,1,null,0,null,0,null,0,null,0,null,null,0]
[null,null,null,null,null,null,null,null,null,null,null,null,null,null,null,null,0,null,1,null,0,null,0,null,0,null,null,0]
[null,null,null,null,null,null,null,null,null,null,null,null,null,null,null,null,1,null,0,null,0,null,0,null,0,null,null,0]
[null,null,null,null,null,null,null,null,null,null,null,null,null,null,null,null,1,null,0,null,0,null,0,null,0,null,null,0]
[null,null,null,null,null,null,null,null,null,null,null,null,null,null,null,null,0.65980346279831537,null,0.16612072999532054,null,0.17407580720636406,null,0,null,0,null,null,0]
[null,null,null,null,null,null,null,null,null,null,null,null,null,null,null,null,8.3294770939379911E-2,null,0.52707080055529842,null,0.1036557149467839,null,0.19134659879685331,null,9.4632114761684386E-2,null,null,0]
[null,null,null,null,null,null,null,null,null,null,null,null,null,null,null,null,0,null,0,null,0,null,1,null,0,null,null,0.61826086956521742]
[null,null,null,null,null,null,null,null,null,null,null,null,null,null,null,null,1,null,0,null,0,null,0,null,0,null,null,0]
[null,null,null,null,null,null,null,null,null,null,null,null,null,null,null,null,0,null,0,null,1,null,0,null,0,null,null,0]
[null,null,null,null,null,null,null,null,null,null,null,null,null,null,null,null,0.5286624203821656,null,0.4713375796178344,null,0,null,0,null,0,null,null,0]
[null,null,null,null,null,null,null,null,null,null,null,null,null,null,null,null,0.1869056327724945,null,0.43708851499634238,null,0.21141185076810534,null,0.16459400146305783,null,0,null,null,0]
[null,null,null,null,null,null,null,null,null,null,null,null,null,null,null,null,0.27545263157894739,null,0.22147368421052632,null,0.16917894736842104,null,0.19031578947368424,null,0.14357894736842106,null,null,0.15875602153584584]
[null,null,null,null,null,null,null,null,null,null,null,null,null,null,null,null,0.83370288248337032,null,0,null,0.16629711751662971,null,0,null,0,null,null,0]
[null,null,null,null,null,null,null,null,null,null,null,null,null,null,null,null,1,null,0,null,0,null,0,null,0,null,null,0]
[null,null,null,null,null,null,null,null,null,null,null,null,null,null,null,null,1,null,0,null,0,null,0,null,0,null,null,0]
[null,null,null,null,null,null,null,null,null,null,null,null,null,null,null,null,0,null,1,null,0,null,0,null,0,null,null,0]
[null,null,null,null,null,null,null,null,null,null,null,null,null,null,null,null,0,null,0,null,0,null,0,null,0,null,null,1]
[]
["Défavorisation matérielle 2021 MRC  ---- LOCAL ----"]
[]
["MATERIEL","Conditions\nplus favorables",null,null,null,"Conditions\nplus défavorables",null,"Population avec indice","Population\nsans indice",null,"Population totale"]
[null,"Quartile 1",null,"Quartile 2-3",null,"Quartile 4"]
[null,"N","%","N","%","N","%","N","N","%","N"]
["MRC Deux-Montagnes",24600,0.24111237408380043,49600,0.48623250891702269,25200,0.24699172970642416,99400,2600,2.5663387292752714E-2,102100,null,null,null,null,null,{"$f":"C280/100","v":2.4111237408380045E-3},null,{"$f":"E280/100","v":4.8623250891702266E-3},null,{"$f":"G280/100","v":2.4699172970642416E-3},null,null,{"$f":"J280/100","v":2.5663387292752712E-4}]
["    Deux-Montagnes",6000,0.33217973765001396,10100,0.56232207647222998,1000,5.3921295004186437E-2,17000,900,5.1576890873569627E-2,17900,null,null,null,null,null,{"$f":"C281/100","v":3.3217973765001397E-3},null,{"$f":"E281/100","v":5.6232207647223002E-3},null,{"$f":"G281/100","v":5.3921295004186437E-4},null,null,{"$f":"J281/100","v":5.1576890873569628E-4}]
["    Oka",1800,0.45136088709677419,1700,0.41658266129032256,500,0.12953629032258066,4000,0,2.5201612903225806E-3,4000,null,null,null,null,null,4.5136088709677421E-3,null,4.1658266129032256E-3,null,1.2953629032258066E-3,null,null,2.5201612903225806E-5]
["    Pointe-Calumet",0,0,1000,0.16382741601655787,5300,0.83617258398344207,6300,0,0,6300,null,null,null,null,null,0,null,1.6382741601655786E-3,null,8.3617258398344212E-3,null,null,0]
["    Sainte-Marthe-sur-le-Lac",700,3.4550689498408851E-2,17000,0.8578572510986513,2100,0.10759205940293985,19800,0,0,19800,null,null,null,null,null,3.455068949840885E-4,null,8.5785725109865131E-3,null,1.0759205940293985E-3,null,null,0]
["    Saint-Eustache",12400,0.27321318137644668,17400,0.38492799717289505,13800,0.30464263627528931,43600,1700,3.721618517536885E-2,45300,null,null,null,null,null,2.7321318137644669E-3,null,3.8492799717289505E-3,null,3.0464263627528933E-3,null,null,3.721618517536885E-4]
["    Saint-Joseph-du-Lac",3100,0.43592661072393679,2500,0.34902574313753376,1500,0.21504764613852939,7000,0,0,7000,null,null,null,null,null,4.3592661072393681E-3,null,3.4902574313753374E-3,null,2.1504764613852938E-3,null,null,0]
["    Saint-Placide",700,0.4176008968609865,0,0,1000,0.58239910313901344,1800,0,0,1800,null,null,null,null,null,4.1760089686098652E-3,null,0,null,5.8239910313901341E-3,null,null,0]
["MRC Thérèse-De Blainville",37500,0.22940500635572506,77700,0.47508433558228219,38500,0.2351740490857534,153800,9900,6.033660897623936E-2,163600,null,null,null,null,null,2.2940500635572503E-3,null,4.750843355822822E-3,null,2.351740490857534E-3,null,null,6.0336608976239363E-4]
["    Blainville",13400,0.22449388990120195,34200,0.57117303866664437,7500,0.12517761915110584,55100,4700,7.9155452281047825E-2,59800,null,null,null,null,null,2.2449388990120195E-3,null,5.7117303866664436E-3,null,1.2517761915110583E-3,null,null,7.9155452281047826E-4]
["    Boisbriand",3800,0.1354034195280486,12600,0.44588102303235838,11900,0.41871555743959304,28300,0,0,28300,null,null,null,null,null,1.3540341952804861E-3,null,4.4588102303235837E-3,null,4.1871555743959307E-3,null,null,0]
["    Bois-des-Filion",1600,0.15995668865045773,5900,0.57643468845358792,2300,0.23004232700068905,9800,300,3.3566295895265282E-2,10200,null,null,null,null,null,1.5995668865045774E-3,null,5.7643468845358795E-3,null,2.3004232700068903E-3,null,null,3.3566295895265283E-4]
["    Lorraine",6100,0.6373395074721111,3400,0.36266049252788884,0,0,9500,0,0,9500,null,null,null,null,null,6.3733950747211108E-3,null,3.6266049252788885E-3,null,0,null,null,0]
["    Rosemère",7600,0.54151880766501059,6500,0.45848119233498935,0,0,14100,0,0,14100,null,null,null,null,null,5.415188076650106E-3,null,4.5848119233498933E-3,null,0,null,null,0]
["    Sainte-Anne-des-Plaines",0,0,3200,0.20747651271269954,10500,0.68687996846462129,13600,1600,0.10564351882267919,15200,null,null,null,null,null,0,null,2.0747651271269952E-3,null,6.8687996846462131E-3,null,null,1.0564351882267919E-3]
["    Sainte-Thérèse",5000,0.18712546640033167,12000,0.45339765574944407,6300,0.23928692571514718,23300,3200,0.12018995213507708,26500,null,null,null,null,null,1.8712546640033167E-3,null,4.5339765574944407E-3,null,2.3928692571514717E-3,null,null,1.2018995213507707E-3]
["Mirabel",12900,0.21047980624468152,32800,0.53729462590822807,15400,0.25222556784709038,61100,0,0,61100,null,null,null,null,null,2.1047980624468153E-3,null,5.3729462590822808E-3,null,2.5222556784709037E-3,null,null,0]
["    Mirabel",12900,0.21047980624468152,32800,0.53729462590822807,15400,0.25222556784709038,61100,0,0,61100,null,null,null,null,null,2.1047980624468153E-3,null,5.3729462590822808E-3,null,2.5222556784709037E-3,null,null,0]
["MRC la Rivière-du-Nord",33900,0.24122825761784694,67100,0.47799763522657662,36600,0.26040998903087026,137500,2900,2.0364118124706187E-2,140400,null,null,null,null,null,2.4122825761784695E-3,null,4.7799763522657661E-3,null,2.6040998903087025E-3,null,null,2.0364118124706186E-4]
["    Prévost",8000,0.58114227286006426,5700,0.41885772713993574,0,0,13700,0,0,13700,null,null,null,null,null,5.8114227286006426E-3,null,4.1885772713993576E-3,null,0,null,null,0]
["    Saint-Colomban",4900,0.27508455467869219,12100,0.68105975197294255,800,4.3855693348365275E-2,17700,0,0,17700,null,null,null,null,null,2.7508455467869218E-3,null,6.8105975197294251E-3,null,4.3855693348365273E-4,null,null,0]
["    Sainte-Sophie",0,0,10000,0.55558628318584069,8000,0.44441371681415931,18100,0,0,18100,null,null,null,null,null,0,null,5.5558628318584068E-3,null,4.4441371681415934E-3,null,null,0]
["    Saint-Hippolyte",4100,0.38616552629112383,5700,0.53510169650388972,800,7.8732777204986407E-2,10700,0,0,10700,null,null,null,null,null,3.8616552629112382E-3,null,5.351016965038897E-3,null,7.8732777204986403E-4,null,null,0]
["    Saint-Jérôme",16900,0.2108137085011158,33500,0.41809931058556593,26900,0.3354443793400072,77400,2900,3.5642601573311061E-2,80200,null,null,null,null,null,2.1081370850111582E-3,null,4.1809931058556593E-3,null,3.3544437934000721E-3,null,null,3.5642601573311063E-4]
["MRC Argenteuil",7900,0.2268358655616943,16800,0.48362684162062614,8600,0.24686348987108656,33300,1500,4.2673802946592995E-2,34800,null,null,null,null,null,2.2683586556169429E-3,null,4.8362684162062616E-3,null,2.4686348987108656E-3,null,null,4.2673802946592993E-4]
["    Brownsburg-Chatham",3300,0.45674072029805435,2100,0.28660135228370359,1900,0.256657927418242,7200,0,0,7200,null,null,null,null,null,4.5674072029805437E-3,null,2.866013522837036E-3,null,2.5665792741824201E-3,null,null,0]
["    Gore",1100,0.49671484888304862,1100,0.50328515111695138,0,0,2300,0,0,2300,null,null,null,null,null,4.9671484888304859E-3,null,5.0328515111695135E-3,null,0,null,null,0]
["    Grenville",0,0,1800,1,0,0,1800,0,0,1800,null,null,null,null,null,0,null,0.01,null,0,null,null,0]
["    Grenville-sur-la-Rouge",0,0,2200,0.7755809920221991,600,0.2244190079778009,2900,0,0,2900,null,null,null,null,null,0,null,7.7558099202219913E-3,null,2.2441900797780089E-3,null,null,0]
["    Harrington",0,0,1000,1,0,0,1000,0,0,1000,null,null,null,null,null,0,null,0.01,null,0,null,null,0]
["    Lachute",1300,9.0141843971631205E-2,5300,0.37404255319148938,6100,0.43063829787234043,12600,1500,0.105177304964539,14100,null,null,null,null,null,9.0141843971631205E-4,null,3.740425531914894E-3,null,4.3063829787234045E-3,null,null,1.05177304964539E-3]
["    Mille-Isles",900,0.50552004648460203,900,0.49447995351539803,0,0,1700,0,0,1700,null,null,null,null,null,5.0552004648460203E-3,null,4.9447995351539799E-3,null,0,null,null,0]
["    Saint-André-d'Argenteuil",600,0.20176875204716674,2400,0.79823124795283329,0,0,3100,0,0,3100,null,null,null,null,null,2.0176875204716673E-3,null,7.9823124795283321E-3,null,0,null,null,0]
["    Wentworth",700,1,0,0,0,0,700,0,0,700,null,null,null,null,null,0.01,null,0,null,0,null,null,0]
["MRC Les Pays-d'en-Haut",11400,0.24540089496098055,23300,0.50331827320089062,11600,0.25106465768823366,46200,0,0,46200,null,null,null,null,null,2.4540089496098054E-3,null,5.0331827320089064E-3,null,2.5106465768823367E-3,null,null,0]
["    Estérel",300,1,0,0,0,0,300,0,0,300,null,null,null,null,null,0.01,null,0,null,0,null,null,0]
["    Lac-des-Seize-îles",0,0,200,1,0,0,200,0,0,200,null,null,null,null,null,0,null,0.01,null,0,null,null,0]
["    Morin-Heights",0,0,4700,1,0,0,4700,0,0,4700,null,null,null,null,null,0,null,0.01,null,0,null,null,0]
["    Piedmont",1300,0.38607594936708867,2100,0.61392405063291144,0,0,3500,0,0,3500,null,null,null,null,null,3.8607594936708868E-3,null,6.1392405063291147E-3,null,0,null,null,0]
["    Saint-Adolphe-d'Howard",700,0.1932531380753138,800,0.21548117154811716,2300,0.59126569037656906,3800,0,0,3800,null,null,null,null,null,1.9325313807531379E-3,null,2.1548117154811717E-3,null,5.9126569037656904E-3,null,null,0]
["    Sainte-Adèle",3900,0.27723054960742327,6100,0.43219129193433259,4100,0.29057815845824408,14000,0,0,14000,null,null,null,null,null,2.7723054960742326E-3,null,4.3219129193433261E-3,null,2.9057815845824407E-3,null,null,0]
["    Sainte-Anne-des-Lacs",3200,1,0,0,0,0,3200,0,0,3200,null,null,null,null,null,0.01,null,0,null,0,null,null,0]
["    Sainte-Marguerite-du-Lac-Masson",0,0,0,0,3400,0.99702999702999706,3400,0,2.9700029700029701E-3,3400,null,null,null,null,null,0,null,0,null,9.9702999702999708E-3,null,null,2.9700029700029701E-5]
["    Saint-Sauveur",1900,0.16493955094991364,8500,0.731692573402418,1200,0.10336787564766839,11600,0,0,11600,null,null,null,null,null,1.6493955094991364E-3,null,7.3169257340241801E-3,null,1.0336787564766839E-3,null,null,0]
["    Wentworth-Nord",0,0,900,0.56459330143540665,700,0.4354066985645933,1700,0,0,1700,null,null,null,null,null,0,null,5.6459330143540662E-3,null,4.3540669856459331E-3,null,null,0]
["MRC Les Laurentides",12100,0.23914370679638419,24000,0.47235953285936544,12700,0.25042834354136717,48800,1900,3.8068416802883198E-2,50800,null,null,null,null,null,2.3914370679638417E-3,null,4.7235953285936546E-3,null,2.5042834354136716E-3,null,null,3.8068416802883201E-4]
["    Amherst",0,0,0,0,1700,1,1700,0,0,1700,null,null,null,null,null,0,null,0,null,0.01,null,null,0]
["    Arundel",0,0,600,1,0,0,600,0,0,600,null,null,null,null,null,0,null,0.01,null,0,null,null,0]
["    Barkmere",0,0,0,0,0,0,0,100,1,100,null,null,null,null,null,0,null,0,null,0,null,null,0.01]
["    Brébeuf",0,0,1000,1,0,0,1000,0,0,1000,null,null,null,null,null,0,null,0.01,null,0,null,null,0]
["    Huberdeau",0,0,500,0.5330243337195828,400,0.46697566628041715,900,0,0,900,null,null,null,null,null,0,null,5.3302433371958278E-3,null,4.6697566628041715E-3,null,null,0]
["    Ivry-sur-le-Lac",400,1,0,0,0,0,400,0,0,400,null,null,null,null,null,0.01,null,0,null,0,null,null,0]
["    La Conception",0,0,600,0.37851997380484614,900,0.62148002619515386,1500,0,0,1500,null,null,null,null,null,0,null,3.7851997380484613E-3,null,6.2148002619515389E-3,null,null,0]
["    La Minerve",0,0,1400,1,0,0,1400,0,0,1400,null,null,null,null,null,0,null,0.01,null,0,null,null,0]
["    Labelle",0,0,1700,0.60433996383363475,1100,0.3956600361663653,2800,0,0,2800,null,null,null,null,null,0,null,6.0433996383363478E-3,null,3.9566003616636532E-3,null,null,0]
["    Lac-Supérieur",600,0.28346855983772817,800,0.38083164300202837,700,0.3356997971602434,2000,0,0,2000,null,null,null,null,null,2.8346855983772817E-3,null,3.8083164300202837E-3,null,3.3569979716024339E-3,null,null,0]
["    Lac-Tremblant-Nord",0,0,0,0,0,0,0,100,1,100,null,null,null,null,null,0,null,0,null,0,null,null,0.01]
["    Lantier",0,0,0,0,900,1,900,0,0,900,null,null,null,null,null,0,null,0,null,0.01,null,null,0]
["    Montcalm",0,0,600,1,0,0,600,0,0,600,null,null,null,null,null,0,null,0.01,null,0,null,null,0]
["    Mont-Tremblant",4300,0.39255822416302766,4100,0.36999636098981076,1400,0.13164119359534207,9800,1200,0.1058042212518195,11000,null,null,null,null,null,3.9255822416302769E-3,null,3.6999636098981074E-3,null,1.3164119359534206E-3,null,null,1.058042212518195E-3]
["    Sainte-Agathe-des-Monts",1300,0.12006065471412006,4900,0.44046026224244045,4300,0.3833734724823834,10600,600,5.6105610561056105E-2,11200,null,null,null,null,null,1.2006065471412005E-3,null,4.4046026224244042E-3,null,3.8337347248238339E-3,null,null,5.6105610561056108E-4]
["    Sainte-Lucie-des-Laurentides",0,0,700,0.46228373702422149,800,0.53771626297577857,1400,0,0,1400,null,null,null,null,null,0,null,4.6228373702422148E-3,null,5.3771626297577854E-3,null,null,0]
["    Mont-Blanc",1400,0.35767195767195775,2000,0.51878306878306879,500,0.12354497354497354,3800,0,0,3800,null,null,null,null,null,3.5767195767195774E-3,null,5.1878306878306883E-3,null,1.2354497354497354E-3,null,null,0]
["    Val-David",3100,0.56045340050377834,2400,0.43954659949622171,0,0,5600,0,0,5600,null,null,null,null,null,5.6045340050377831E-3,null,4.3954659949622171E-3,null,0,null,null,0]
["    Val-des-Lacs",0,0,800,1,0,0,800,0,0,800,null,null,null,null,null,0,null,0.01,null,0,null,null,0]
["    Val-Morin",1100,0.34101825168107586,2100,0.65898174831892409,0,0,3100,0,0,3100,null,null,null,null,null,{"$f":"C345/100","v":3.4101825168107586E-3},null,{"$f":"E345/100","v":6.5898174831892408E-3},null,{"$f":"G345/100","v":0},null,null,{"$f":"J345/100","v":0}]
["MRC Antoine-Labelle",8300,0.22840606742189429,16800,0.46070713443234496,8700,0.23910360150314069,33800,2600,7.1783196642620076E-2,36500,null,null,null,null,null,2.2840606742189429E-3,null,4.6070713443234499E-3,null,2.3910360150314071E-3,null,null,7.1783196642620072E-4]
["    Chute-Saint-Philippe",0,0,500,0.44947064485081811,600,0.55052935514918189,1000,0,0,1000,null,null,null,null,null,0,null,4.4947064485081813E-3,null,5.5052935514918189E-3,null,null,0]
["    Ferme-Neuve",400,0.14653902798232696,1100,0.40132547864506629,1200,0.45213549337260678,2700,0,0,2700,null,null,null,null,null,1.4653902798232696E-3,null,4.0132547864506632E-3,null,4.5213549337260678E-3,null,null,0]
["    Kiamika",0,0,800,1,0,0,800,0,0,800,null,null,null,null,null,0,null,0.01,null,0,null,null,0]
["    La Macaza",0,0,500,0.41590493601462525,0,0,500,600,0.58409506398537481,1100,null,null,null,null,null,0,null,4.1590493601462528E-3,null,0,null,null,5.8409506398537482E-3]
["    Lac-des-Écorces",500,0.18890814558058924,1300,0.44298093587521664,1100,0.36811091854419409,2900,0,0,2900,null,null,null,null,null,1.8890814558058925E-3,null,4.4298093587521667E-3,null,3.681109185441941E-3,null,null,0]
["    Lac-du-Cerf",0,0,0,0,400,1,400,0,0,400,null,null,null,null,null,0,null,0,null,0.01,null,null,0]
["    Lac-Saguay",0,0,500,1,0,0,500,0,0,500,null,null,null,null,null,0,null,0.01,null,0,null,null,0]
["    Lac-Saint-Paul",0,0,500,1,0,0,500,0,0,500,null,null,null,null,null,0,null,0.01,null,0,null,null,0]
["    L'Ascension",0,0,400,0.43937708565072309,500,0.56062291434927702,900,0,0,900,null,null,null,null,null,0,null,4.3937708565072306E-3,null,5.6062291434927705E-3,null,null,0]
["    Mont-Laurier",5300,0.37616361071932297,4600,0.3229901269393512,2300,0.16135401974612129,12200,2000,0.13949224259520451,14200,null,null,null,null,null,3.7616361071932296E-3,null,3.2299012693935121E-3,null,1.6135401974612129E-3,null,null,1.3949224259520452E-3]
["    Mont-Saint-Michel",0,0,0,0,600,1,600,0,0,600,null,null,null,null,null,0,null,0,null,0.01,null,null,0]
["    Nominingue",700,0.32283813747228379,1200,0.52993348115299332,300,0.14722838137472283,2300,0,0,2300,null,null,null,null,null,3.228381374722838E-3,null,5.2993348115299328E-3,null,1.4722838137472282E-3,null,null,0]
["    Notre-Dame-de-Pontmain",0,0,0,0,800,1,800,0,0,800,null,null,null,null,null,0,null,0,null,0.01,null,null,0]
["    Notre-Dame-du-Laus",500,0.28728323699421965,1200,0.71271676300578035,0,0,1700,0,0,1700,null,null,null,null,null,2.8728323699421963E-3,null,7.1271676300578039E-3,null,0,null,null,0]
["    Rivière-Rouge",800,0.17814726840855108,2900,0.62427121572014688,900,0.1975815158713021,4600,0,0,4600,null,null,null,null,null,1.7814726840855108E-3,null,6.2427121572014689E-3,null,1.9758151587130211E-3,null,null,0]
["    Saint-Aimé-du-Lac-des-îles",0,0,800,1,0,0,800,0,0,800,null,null,null,null,null,0,null,0.01,null,0,null,null,0]
["    Sainte-Anne-du-Lac",0,0,600,1,0,0,600,0,0,600,null,null,null,null,null,0,null,0.01,null,0,null,null,0]
["   Territoires non organisés","ND","ND","ND","ND","ND","ND","ND","ND","ND","ND",null,null,null,null,null,{"$error":"#VALUE!"},null,{"$error":"#VALUE!"},null,{"$error":"#VALUE!"},null,null,{"$error":"#VALUE!"}]
[]
["Défavorisation sociale 2021 MRC  ---- LOCAL ----"]
[]
["SOCIAL","Conditions\nplus favorables",null,null,null,"Conditions\nplus défavorables",null,"Population avec indice","Population\nsans indice",null,"Population totale"]
[null,"Quartile 1",null,"Quartile 2-3",null,"Quartile 4"]
[null,"N","%","N","%","N","%","N","N","%","N"]
["MRC Deux-Montagnes",24800,0.24272919688002192,49500,0.48502724101438482,25200,0.24658017481284053,99400,2600,2.5663387292752714E-2,102100,null,null,null,null,null,{"$f":"C371/100","v":2.4272919688002191E-3},null,{"$f":"E371/100","v":4.8502724101438487E-3},null,{"$f":"G371/100","v":2.4658017481284052E-3},null,null,{"$f":"J371/100","v":2.5663387292752712E-4}]
["    Deux-Montagnes",2800,0.15662852358358917,7200,0.39916271281049398,7000,0.39263187273234723,17000,900,5.1576890873569627E-2,17900,null,null,null,null,null,{"$f":"C372/100","v":1.5662852358358918E-3},null,{"$f":"E372/100","v":3.99162712810494E-3},null,{"$f":"G372/100","v":3.9263187273234721E-3},null,null,{"$f":"J372/100","v":5.1576890873569628E-4}]
["    Oka",1800,0.45740927419354838,2100,0.540070564516129,0,0,4000,0,2.5201612903225806E-3,4000,null,null,null,null,null,4.5740927419354836E-3,null,5.4007056451612903E-3,null,0,null,null,2.5201612903225806E-5]
["    Pointe-Calumet",1100,0.16876293583824231,2200,0.35567584779493716,3000,0.47556121636682058,6300,0,0,6300,null,null,null,null,null,1.6876293583824231E-3,null,3.5567584779493716E-3,null,4.7556121636682059E-3,null,null,0]
["    Sainte-Marthe-sur-le-Lac",1200,6.2332676668182048E-2,16700,0.84128908420467752,1900,9.6378239127140469E-2,19800,0,0,19800,null,null,null,null,null,6.2332676668182046E-4,null,8.4128908420467753E-3,null,9.6378239127140465E-4,null,null,0]
["    Saint-Eustache",14700,0.3239243749447831,15700,0.34654121388815268,13200,0.29231822599169538,43600,1700,3.721618517536885E-2,45300,null,null,null,null,null,3.2392437494478312E-3,null,3.4654121388815267E-3,null,2.9231822599169537E-3,null,null,3.721618517536885E-4]
["    Saint-Joseph-du-Lac",3200,0.45370502062295548,3800,0.54629497937704452,0,0,7000,0,0,7000,null,null,null,null,null,4.5370502062295551E-3,null,5.4629497937704451E-3,null,0,null,null,0]
["    Saint-Placide",0,0,1800,1,0,0,1800,0,0,1800,null,null,null,null,null,0,null,0.01,null,0,null,null,0]
["MRC Thérèse-De Blainville",25400,0.15551970274762883,89600,0.54738070792998927,38700,0.23676298034614254,153800,9900,6.033660897623936E-2,163600,null,null,null,null,null,1.5551970274762883E-3,null,5.4738070792998928E-3,null,2.3676298034614254E-3,null,null,6.0336608976239363E-4]
["    Blainville",9500,0.15913004229425434,39100,0.65397281800096962,6400,0.10774168742372826,55100,4700,7.9155452281047825E-2,59800,null,null,null,null,null,1.5913004229425433E-3,null,6.5397281800096962E-3,null,1.0774168742372827E-3,null,null,7.9155452281047826E-4]
["    Boisbriand",3600,0.1287975130705101,16900,0.59749894022891059,7700,0.27370354670057934,28300,0,0,28300,null,null,null,null,null,1.2879751307051011E-3,null,5.9749894022891057E-3,null,2.7370354670057935E-3,null,null,0]
["    Bois-des-Filion",500,5.2564228762673491E-2,4400,0.43724776060635889,4800,0.47662171473570231,9800,300,3.3566295895265282E-2,10200,null,null,null,null,null,5.2564228762673492E-4,null,4.3724776060635887E-3,null,4.766217147357023E-3,null,null,3.3566295895265283E-4]
["    Lorraine",5100,0.53357187960429386,4400,0.46642812039570619,0,0,9500,0,0,9500,null,null,null,null,null,5.3357187960429387E-3,null,4.6642812039570623E-3,null,0,null,null,0]
["    Rosemère",4100,0.2929737402413059,8800,0.62633073101490422,1100,8.0695528743789921E-2,14100,0,0,14100,null,null,null,null,null,2.929737402413059E-3,null,6.2633073101490419E-3,null,8.0695528743789926E-4,null,null,0]
["    Sainte-Anne-des-Plaines",1700,0.11122790881019644,9100,0.59838381183890677,2800,0.18474476052821762,13600,1600,0.10564351882267919,15200,null,null,null,null,null,1.1122790881019644E-3,null,5.9838381183890677E-3,null,1.8474476052821763E-3,null,null,1.0564351882267919E-3]
["    Sainte-Thérèse",900,3.2337089661930427E-2,6700,0.25357102476161758,15800,0.59390193344137487,23300,3200,0.12018995213507708,26500,null,null,null,null,null,3.2337089661930426E-4,null,2.5357102476161759E-3,null,5.9390193344137487E-3,null,null,1.2018995213507707E-3]
["Mirabel",16300,0.26598808666623031,29800,0.48846304902795057,15000,0.24554886430581921,61100,0,0,61100,null,null,null,null,null,2.659880866662303E-3,null,4.8846304902795054E-3,null,2.4554886430581922E-3,null,null,0]
["    Mirabel",16300,0.26598808666623031,29800,0.48846304902795057,15000,0.24554886430581921,61100,0,0,61100,null,null,null,null,null,2.659880866662303E-3,null,4.8846304902795054E-3,null,2.4554886430581922E-3,null,null,0]
["MRC la Rivière-du-Nord",34200,0.24335797826117925,68900,0.4909184153168939,34400,0.24535948829722065,137500,2900,2.0364118124706187E-2,140400,null,null,null,null,null,2.4335797826117926E-3,null,4.9091841531689389E-3,null,2.4535948829722065E-3,null,null,2.0364118124706186E-4]
["    Prévost",5600,0.41221151037101955,5700,0.41929593923458952,2300,0.16849255039439087,13700,0,0,13700,null,null,null,null,null,4.1221151037101958E-3,null,4.1929593923458949E-3,null,1.6849255039439086E-3,null,null,0]
["    Saint-Colomban",10800,0.60806087936865838,7000,0.39193912063134162,0,0,17700,0,0,17700,null,null,null,null,null,6.0806087936865838E-3,null,3.9193912063134164E-3,null,0,null,null,0]
["    Sainte-Sophie",4400,0.24170353982300885,13700,0.75829646017699115,0,0,18100,0,0,18100,null,null,null,null,null,2.4170353982300883E-3,null,7.5829646017699119E-3,null,0,null,null,0]
["    Saint-Hippolyte",3400,0.31736807573343329,7300,0.68263192426656671,0,0,10700,0,0,10700,null,null,null,null,null,3.1736807573343327E-3,null,6.826319242665667E-3,null,0,null,null,0]
["    Saint-Jérôme",10000,0.12440626831062299,35200,0.43926794908555972,32100,0.40068318103050626,77400,2900,3.5642601573311061E-2,80200,null,null,null,null,null,1.2440626831062298E-3,null,4.3926794908555975E-3,null,4.0068318103050624E-3,null,null,3.5642601573311063E-4]
["MRC Argenteuil",8000,0.23129604051565378,16600,0.47695096685082872,8700,0.2490791896869245,33300,0,0,33300,null,null,null,null,null,2.3129604051565378E-3,null,4.7695096685082868E-3,null,2.4907918968692451E-3,null,null,0]
["    Brownsburg-Chatham",700,0.10169725403615289,5900,0.81661377121567535,600,8.1688974748171661E-2,7200,0,0,7200,null,null,null,null,null,1.0169725403615288E-3,null,8.1661377121567541E-3,null,8.1688974748171661E-4,null,null,0]
["    Gore",2300,1,0,0,0,0,2300,0,0,2300,null,null,null,null,null,0.01,null,0,null,0,null,null,0]
["    Grenville",0,0,0,0,1800,1,1800,0,0,1800,null,null,null,null,null,0,null,0,null,0.01,null,null,0]
["    Grenville-sur-la-Rouge",1200,0.4030523759972251,1700,0.5969476240027749,0,0,2900,0,0,2900,null,null,null,null,null,4.0305237599722512E-3,null,5.969476240027749E-3,null,0,null,null,0]
["    Harrington",0,0,1000,1,0,0,1000,0,0,1000,null,null,null,null,null,0,null,0.01,null,0,null,null,0]
["    Lachute",900,6.4893617021276592E-2,5500,0.38680851063829785,6200,0.44312056737588645,12600,1500,0.105177304964539,14100,null,null,null,null,null,6.4893617021276589E-4,null,3.8680851063829787E-3,null,4.4312056737588644E-3,null,null,1.05177304964539E-3]
["    Mille-Isles",1700,1,0,0,0,0,1700,0,0,1700,null,null,null,null,null,0.01,null,0,null,0,null,null,0]
["    Saint-André-d'Argenteuil",1200,0.39960694398951851,1800,0.60039305601048154,0,0,3100,0,0,3100,null,null,null,null,null,3.996069439895185E-3,null,6.0039305601048152E-3,null,0,null,null,0]
["    Wentworth",0,0,700,1,0,0,700,0,0,700,null,null,null,null,null,0,null,0.01,null,0,null,null,0]
["MRC Les Pays-d'en-Haut",11400,0.2459845651656975,22600,0.48954797985256915,12200,0.26425128083183813,46200,0,2.1617414989515555E-4,46300,null,null,null,null,null,2.4598456516569749E-3,null,4.8954797985256912E-3,null,2.6425128083183815E-3,null,null,2.1617414989515555E-6]
["    Estérel",300,1,0,0,0,0,300,0,0,300,null,null,null,null,null,0.01,null,0,null,0,null,null,0]
["    Lac-des-Seize-îles",200,1,0,0,0,0,200,0,0,200,null,null,null,null,null,0.01,null,0,null,0,null,null,0]
["    Morin-Heights",2100,0.43864899529713552,2600,0.56135100470286448,0,0,4700,0,0,4700,null,null,null,null,null,4.386489952971355E-3,null,5.6135100470286444E-3,null,0,null,null,0]
["    Piedmont",800,0.23388952819332565,0,0,2700,0.76611047180667446,3500,0,0,3500,null,null,null,null,null,2.3388952819332564E-3,null,0,null,7.6611047180667443E-3,null,null,0]
["    Saint-Adolphe-d'Howard",700,0.19194560669456068,3100,0.80805439330543938,0,0,3800,0,0,3800,null,null,null,null,null,1.9194560669456068E-3,null,8.0805439330543932E-3,null,0,null,null,0]
["    Sainte-Adèle",1900,0.13283369022127053,5500,0.39607423269093511,6600,0.47109207708779444,14000,0,0,14000,null,null,null,null,null,1.3283369022127054E-3,null,3.9607423269093509E-3,null,4.7109207708779443E-3,null,null,0]
["    Sainte-Anne-des-Lacs",700,0.23265940902021773,2500,0.76734059097978213,0,0,3200,0,0,3200,null,null,null,null,null,2.3265940902021773E-3,null,7.6734059097978216E-3,null,0,null,null,0]
["    Sainte-Marguerite-du-Lac-Masson",1800,0.53786753786753783,1500,0.45916245916245918,0,0,3400,0,2.9700029700029701E-3,3400,null,null,null,null,null,5.3786753786753787E-3,null,4.5916245916245921E-3,null,0,null,null,2.9700029700029701E-5]
["    Saint-Sauveur",2000,0.17089810017271156,6600,0.57340241796200342,3000,0.25569948186528496,11600,0,0,11600,null,null,null,null,null,1.7089810017271157E-3,null,5.734024179620034E-3,null,2.5569948186528494E-3,null,null,0]
["    Wentworth-Nord",900,0.56459330143540665,700,0.4354066985645933,0,0,1700,0,0,1700,null,null,null,null,null,5.6459330143540662E-3,null,4.3540669856459331E-3,null,0,null,null,0]
["MRC Les Laurentides",12100,0.2374500265868405,24400,0.48065068830375957,12400,0.24383086830651673,48800,1900,3.8068416802883198E-2,50800,null,null,null,null,null,2.3745002658684049E-3,null,4.8065068830375956E-3,null,2.4383086830651675E-3,null,null,3.8068416802883201E-4]
["    Amherst",1000,0.60185185185185186,700,0.39814814814814814,0,0,1700,0,0,1700,null,null,null,null,null,6.0185185185185185E-3,null,3.9814814814814817E-3,null,0,null,null,0]
["    Arundel",0,0,0,0,600,1,600,0,0,600,null,null,null,null,null,0,null,0,null,0.01,null,null,0]
["    Barkmere",0,0,0,0,0,0,0,100,1,100,null,null,null,null,null,0,null,0,null,0,null,null,0.01]
["    Brébeuf",600,0.554013875123885,500,0.445986124876115,0,0,1000,0,0,1000,null,null,null,null,null,5.5401387512388498E-3,null,4.4598612487611496E-3,null,0,null,null,0]
["    Huberdeau",0,0,900,1,0,0,900,0,0,900,null,null,null,null,null,0,null,0.01,null,0,null,null,0]
["    Ivry-sur-le-Lac",400,1,0,0,0,0,400,0,0,400,null,null,null,null,null,0.01,null,0,null,0,null,null,0]
["    La Conception",600,0.37851997380484614,900,0.62148002619515386,0,0,1500,0,0,1500,null,null,null,null,null,3.7851997380484613E-3,null,6.2148002619515389E-3,null,0,null,null,0]
["    La Minerve",1400,1,0,0,0,0,1400,0,0,1400,null,null,null,null,null,0.01,null,0,null,0,null,null,0]
["    Labelle",800,0.27233273056057866,2000,0.7276672694394215,0,0,2800,0,0,2800,null,null,null,null,null,2.7233273056057865E-3,null,7.2766726943942154E-3,null,0,null,null,0]
["    Lac-Supérieur",0,0,2000,1,0,0,2000,0,0,2000,null,null,null,null,null,0,null,0.01,null,0,null,null,0]
["    Lac-Tremblant-Nord",0,0,0,0,0,0,0,100,1,100,null,null,null,null,null,0,null,0,null,0,null,null,0.01]
["    Lantier",900,1,0,0,0,0,900,0,0,900,null,null,null,null,null,0.01,null,0,null,0,null,null,0]
["    Montcalm",0,0,600,1,0,0,600,0,0,600,null,null,null,null,null,0,null,0.01,null,0,null,null,0]
["    Mont-Tremblant",1900,0.17330786026200873,3800,0.34825327510917037,4100,0.37263464337700147,9800,1200,0.1058042212518195,11000,null,null,null,null,null,1.7330786026200874E-3,null,3.4825327510917036E-3,null,3.7263464337700149E-3,null,null,1.058042212518195E-3]
["    Sainte-Agathe-des-Monts",2300,0.20622602800820622,4400,0.39247167960039248,3900,0.34519668183034519,10600,600,5.6105610561056105E-2,11200,null,null,null,null,null,2.0622602800820624E-3,null,3.9247167960039251E-3,null,3.4519668183034518E-3,null,null,5.6105610561056108E-4]
["    Sainte-Lucie-des-Laurentides",1400,1,0,0,0,0,1400,0,0,1400,null,null,null,null,null,0.01,null,0,null,0,null,null,0]
["    Mont-Blanc",800,0.20158730158730159,2500,0.64920634920634923,600,0.1492063492063492,3800,0,0,3800,null,null,null,null,null,2.0158730158730161E-3,null,6.4920634920634926E-3,null,1.492063492063492E-3,null,null,0]
["    Val-David",0,0,3000,0.53976250449802088,2600,0.46023749550197912,5600,0,0,5600,null,null,null,null,null,0,null,5.3976250449802084E-3,null,4.6023749550197909E-3,null,null,0]
["    Val-des-Lacs",0,0,800,1,0,0,800,0,0,800,null,null,null,null,null,0,null,0.01,null,0,null,null,0]
["    Val-Morin",0,0,2400,0.77105347422350301,700,0.22894652577649699,3100,0,0,3100,null,null,null,null,null,{"$f":"C436/100","v":0},null,{"$f":"E436/100","v":7.7105347422350302E-3},null,{"$f":"G436/100","v":2.28946525776497E-3},null,null,{"$f":"J436/100","v":0}]
["MRC Antoine-Labelle",7700,0.21016540033464082,17300,0.47513509065474396,8900,0.24291631236799519,33800,2600,7.1783196642620076E-2,36500,null,null,null,null,null,2.1016540033464083E-3,null,4.7513509065474392E-3,null,2.4291631236799519E-3,null,null,7.1783196642620072E-4]
["    Chute-Saint-Philippe",600,0.55052935514918189,500,0.44947064485081811,0,0,1000,0,0,1000,null,null,null,null,null,5.5052935514918189E-3,null,4.4947064485081813E-3,null,0,null,null,0]
["    Ferme-Neuve",1500,0.55265095729013258,800,0.28755522827687774,400,0.15979381443298968,2700,0,0,2700,null,null,null,null,null,5.526509572901326E-3,null,2.8755522827687775E-3,null,1.5979381443298967E-3,null,null,0]
["    Kiamika",0,0,800,1,0,0,800,0,0,800,null,null,null,null,null,0,null,0.01,null,0,null,null,0]
["    La Macaza",0,0,0,0,500,0.41590493601462525,500,600,0.58409506398537481,1100,null,null,null,null,null,0,null,0,null,4.1590493601462528E-3,null,null,5.8409506398537482E-3]
["    Lac-des-Écorces",500,0.18162911611785096,800,0.29081455805892548,1500,0.52755632582322354,2900,0,0,2900,null,null,null,null,null,1.8162911611785096E-3,null,2.9081455805892546E-3,null,5.2755632582322355E-3,null,null,0]
["    Lac-du-Cerf",0,0,400,1,0,0,400,0,0,400,null,null,null,null,null,0,null,0.01,null,0,null,null,0]
["    Lac-Saguay",0,0,500,1,0,0,500,0,0,500,null,null,null,null,null,0,null,0.01,null,0,null,null,0]
["    Lac-Saint-Paul",500,1,0,0,0,0,500,0,0,500,null,null,null,null,null,0.01,null,0,null,0,null,null,0]
["    L'Ascension",0,0,900,1,0,0,900,0,0,900,null,null,null,null,null,0,null,0.01,null,0,null,null,0]
["    Mont-Laurier",2600,0.18124118476727782,5900,0.41593794076163609,3700,0.26332863187588151,12200,2000,0.13949224259520451,14200,null,null,null,null,null,1.8124118476727782E-3,null,4.1593794076163612E-3,null,2.6332863187588152E-3,null,null,1.3949224259520452E-3]
["    Mont-Saint-Michel",0,0,600,1,0,0,600,0,0,600,null,null,null,null,null,0,null,0.01,null,0,null,null,0]
["    Nominingue",400,0.1574279379157428,1600,0.69534368070953434,300,0.14722838137472283,2300,0,0,2300,null,null,null,null,null,1.5742793791574282E-3,null,6.9534368070953432E-3,null,1.4722838137472282E-3,null,null,0]
["    Notre-Dame-de-Pontmain",800,1,0,0,0,0,800,0,0,800,null,null,null,null,null,0.01,null,0,null,0,null,null,0]
["    Notre-Dame-du-Laus",0,0,1700,1,0,0,1700,0,0,1700,null,null,null,null,null,0,null,0.01,null,0,null,null,0]
["    Rivière-Rouge",800,0.17814726840855108,2000,0.42820125242928092,1800,0.39365147916216797,4600,0,0,4600,null,null,null,null,null,1.7814726840855108E-3,null,4.2820125242928088E-3,null,3.93651479162168E-3,null,null,0]
["    Saint-Aimé-du-Lac-des-îles",0,0,800,1,0,0,800,0,0,800,null,null,null,null,null,0,null,0.01,null,0,null,null,0]
["    Sainte-Anne-du-Lac",0,0,0,0,600,1,600,0,0,600,null,null,null,null,null,0,null,0,null,0.01,null,null,0]
["   Territoires non organisés","ND","ND","ND","ND","ND","ND","ND","ND","ND","ND"]
[]
["Défavorisation matérielle et sociale 2021 MRC  ---- RÉGIONAL ----"]
["Répartition de la population selon les niveaux de DÉFAVORISATION MATÉRIELLE et SOCIALE des MUNICIPALITÉS des MRC de la région des Laurentides, 2021\n"]
[null,"Profil 1",null,"Profil 2",null,"Profil 3",null,"Profil 4",null,"Profil 5",null,"Population avec indice","Population\nsans indice",null,"Population totale"]
[null,"matériellement \nET socialement \nplus favorables",null,"moyennes matériellement\nEt socialement",null,"socialement\nplus défavorables\n(pas matériellement)",null,"matériellement\nplus défavorables\n(pas socialement)",null,"matériellement\nET socialement\nplus défavorables"]
[null,"N","%","N","%","N","%","N","%","N","%","N","N","%","N"]
["Région des Laurentides",{"$f":"B463+B472+B481+B484+B491+B502+B514+B536","v":101800},{"$f":"B462/$O462","v":0.16003772991667978},{"$f":"D463+D472+D481+D484+D491+D502+D514+D536","v":123800},{"$f":"D462/$O462","v":0.19462348687313316},{"$f":"F463+F472+F481+F484+F491+F502+F514+F536","v":142900},{"$f":"F462/$O462","v":0.22465021223078133},{"$f":"H463+H472+H481+H484+H491+H502+H514+H536","v":141000},{"$f":"H462/$O462","v":0.22166326049363308},{"$f":"J463+J472+J481+J484+J491+J502+J514+J536","v":105100},{"$f":"J462/$O462","v":0.16522559346014778},{"$f":"L463+L472+L481+L484+L491+L502+L514+L536","v":614600},{"$f":"M463+M472+M481+M484+M491+M502+M514+M536","v":21400},{"$f":"M462/$O462","v":3.3642509039459208E-2},{"$f":"O463+O472+O481+O484+O491+O502+O514+O536","v":636100}]
["MRC Deux-Montagnes",22100,0.2163700858385921,22800,0.22368988358875869,19400,0.1904617253948967,22400,0.21916277975933837,12700,0.12465213812566142,99400,2600,2.5663387292752714E-2,102100,null,{"$f":"C463/100","v":2.1637008583859211E-3},null,{"$f":"E463/100","v":2.2368988358875868E-3},null,{"$f":"G463/100","v":1.904617253948967E-3},null,2.1916277975933835E-3,null,1.2465213812566142E-3,null,null,{"$f":"N463/100","v":2.5663387292752712E-4}]
["    Deux-Montagnes",3000,0.1657828635221881,4300,0.24058051911805753,7100,0.39759977672341612,1500,8.3393804074797656E-2,1100,6.1066145687970967E-2,17000,900,5.1576890873569627E-2,17900,null,{"$f":"C464/100","v":1.657828635221881E-3},null,{"$f":"E464/100","v":2.4058051911805753E-3},null,{"$f":"G464/100","v":3.975997767234161E-3},null,{"$f":"I464/100","v":8.339380407479766E-4},null,{"$f":"K464/100","v":6.1066145687970971E-4},null,null,{"$f":"N464/100","v":5.1576890873569628E-4}]
["    Oka",1800,0.45136088709677419,1100,0.27923387096774194,500,0.13734879032258066,500,0.12953629032258066,0,0,4000,0,2.5201612903225806E-3,4000,null,4.5136088709677421E-3,null,2.7923387096774194E-3,null,1.3734879032258065E-3,null,1.2953629032258066E-3,null,0,null,null,2.5201612903225806E-5]
["    Pointe-Calumet",0,0,0,0,500,8.0560420315236414E-2,3300,0.52443878363317942,2500,0.39500079605158417,6300,0,0,6300,null,0,null,0,null,8.0560420315236409E-4,null,5.2443878363317943E-3,null,3.9500079605158415E-3,null,null,0]
["    Sainte-Marthe-sur-le-Lac",6500,0.326867707228368,7100,0.35944840127292016,2300,0.11708844774460775,3000,0.15057837046017072,900,4.6017073293933425E-2,19800,0,0,19800,null,3.2686770722836801E-3,null,3.5944840127292016E-3,null,1.1708844774460775E-3,null,1.5057837046017072E-3,null,4.6017073293933426E-4,null,null,0]
["    Saint-Eustache",9300,0.20631239508790528,8800,0.19489354183231733,7400,0.16317695909532645,9800,0.21651647672055835,8200,0.18188444208852375,43600,1700,3.721618517536885E-2,45300,null,2.0631239508790526E-3,null,1.9489354183231734E-3,null,1.6317695909532645E-3,null,2.1651647672055836E-3,null,1.8188444208852375E-3,null,null,3.721618517536885E-4]
["    Saint-Joseph-du-Lac",1500,0.21447873702176076,700,0.10311477741430806,1600,0.22144787370217606,3200,0.46095861186175502,0,0,7000,0,0,7000,null,2.1447873702176074E-3,null,1.0311477741430806E-3,null,2.2144787370217607E-3,null,4.6095861186175504E-3,null,0,null,null,0]
["    Saint-Placide",0,0,700,0.4176008968609865,0,0,1000,0.58239910313901344,0,0,1800,0,0,1800,null,0,null,4.1760089686098652E-3,null,0,null,5.8239910313901341E-3,null,0,null,null,0]
["Région des Laurentides",101800,0.16003772991667978,123800,0.19462348687313316,142900,0.22465021223078133,141000,0.22166326049363308,105100,0.16522559346014778,614600,21400,3.3642509039459208E-2,636100,null,1.6003772991667977E-3,null,1.9462348687313317E-3,null,2.2465021223078132E-3,null,2.2166326049363307E-3,null,1.6522559346014778E-3,null,null,3.364250903945921E-4]
["MRC/RLS Thérèse-De Blainville",51900,0.31697956389948179,21500,0.13156350836022293,41300,0.25229783905348585,21500,0.13164906619732081,17500,0.10717341351324924,153800,9900,6.033660897623936E-2,163600,null,3.169795638994818E-3,null,1.3156350836022292E-3,null,2.5229783905348583E-3,null,1.316490661973208E-3,null,1.0717341351324924E-3,null,null,6.0336608976239363E-4]
["    Blainville",22800,0.38109965061268158,11000,0.18398836490078402,13800,0.23057891305438072,4900,8.248215449940656E-2,2600,4.2695464651699294E-2,55100,4700,7.9155452281047825E-2,59800,null,3.8109965061268159E-3,null,1.8398836490078401E-3,null,2.305789130543807E-3,null,8.2482154499406561E-4,null,4.2695464651699294E-4,null,null,7.9155452281047826E-4]
["    Boisbriand",6200,0.21845414723753001,2700,9.4708209693372888E-2,7600,0.26812208562950401,7300,0.25717111770524231,4600,0.16154443973435073,28300,0,0,28300,null,2.1845414723753002E-3,null,9.4708209693372886E-4,null,2.6812208562950403E-3,null,2.571711177052423E-3,null,1.6154443973435072E-3,null,null,0]
["    Bois-des-Filion",500,5.0300226400236243E-2,1700,0.16438625849000885,5300,0.52170489221380056,1700,0.17147357023329068,600,5.856875676739836E-2,9800,300,3.3566295895265282E-2,10200,null,5.030022640023624E-4,null,1.6438625849000885E-3,null,5.2170489221380059E-3,null,1.7147357023329069E-3,null,5.8568756767398355E-4,null,null,3.3566295895265283E-4]
["    Lorraine",8700,0.91286045043148822,400,4.3990738791833295E-2,400,4.3148810776678592E-2,0,0,0,0,9500,0,0,9500,null,9.1286045043148818E-3,null,4.3990738791833294E-4,null,4.3148810776678595E-4,null,0,null,0,null,null,0]
["    Rosemère",9300,0.65833924769339958,1600,0.11156848828956707,3200,0.23009226401703337,0,0,0,0,14100,0,0,14100,null,6.5833924769339962E-3,null,1.1156848828956707E-3,null,2.3009226401703338E-3,null,0,null,0,null,null,0]
["    Sainte-Anne-des-Plaines",800,5.203337494251363E-2,1800,0.1162210104460942,0,0,7200,0.47572432823073385,3800,0.25037776755797908,13600,1600,0.10564351882267919,15200,null,5.2033374942513631E-4,null,1.162210104460942E-3,null,0,null,4.7572432823073385E-3,null,2.5037776755797909E-3,null,null,1.0564351882267919E-3]
["    Sainte-Thérèse",3600,0.13696151961708061,2400,9.0905664644028189E-2,10900,0.41265593788866695,300,1.3002675913013982E-2,6000,0.22628424980213319,23300,3200,0.12018995213507708,26500,null,1.3696151961708062E-3,null,9.0905664644028194E-4,null,4.1265593788866696E-3,null,1.3002675913013982E-4,null,2.2628424980213318E-3,null,null,1.2018995213507707E-3]
["Région des Laurentides",101800,0.16003772991667978,123800,0.19462348687313316,142900,0.22465021223078133,141000,0.22166326049363308,105100,0.16522559346014778,614600,21400,3.3642509039459208E-2,636100,null,1.6003772991667977E-3,null,1.9462348687313317E-3,null,2.2465021223078132E-3,null,2.2166326049363307E-3,null,1.6522559346014778E-3,null,null,3.364250903945921E-4]
["Mirabel",5700,9.3392027230477181E-2,25000,0.40899999999999997,16200,0.26400000000000001,7500,0.12300000000000001,6700,0.11,61100,0,0,61100,null,9.3392027230477181E-4,null,4.0899999999999999E-3,null,2.64E-3,null,1.2300000000000002E-3,null,1.1000000000000001E-3,null,null,0]
["    Mirabel",5700,9.3392027230477181E-2,25000,0.40899999999999997,16200,0.26400000000000001,7500,0.12300000000000001,6700,0.11,61100,0,0,61100,null,9.3392027230477181E-4,null,4.0899999999999999E-3,null,2.64E-3,null,1.2300000000000002E-3,null,1.1000000000000001E-3,null,null,0]
["Région des Laurentides",101800,0.16003772991667978,123800,0.19462348687313316,142900,0.22465021223078133,141000,0.22166326049363308,105100,0.16522559346014778,614600,21400,3.3642509039459208E-2,636100,null,1.6003772991667977E-3,null,1.9462348687313317E-3,null,2.2465021223078132E-3,null,2.2166326049363307E-3,null,1.6522559346014778E-3,null,null,3.364250903945921E-4]
["MRC la Rivière-du-Nord",12900,9.2141530592598192E-2,26200,0.1867896970093762,33900,0.2414626317755906,34600,0.24660513554072958,29900,0.21263754488152217,137500,2900,2.0363460200183287E-2,140400,null,9.2141530592598189E-4,null,1.867896970093762E-3,null,2.4146263177559062E-3,null,2.466051355407296E-3,null,2.1263754488152218E-3,null,null,2.0363460200183286E-4]
["    Prévost",4500,0.32887817703768624,1500,0.1105024832018697,4300,0.31763073327490504,2600,0.19339760444054924,700,4.9591002044989778E-2,13700,0,0,13700,null,3.2887817703768623E-3,null,1.105024832018697E-3,null,3.1763073327490503E-3,null,1.9339760444054923E-3,null,4.9591002044989776E-4,null,null,0]
["    Saint-Colomban",4900,0.27526986335399245,6700,0.3760594247153039,0,0,6200,0.34867071193070365,0,0,17700,0,0,17700,null,2.7526986335399246E-3,null,3.7605942471530388E-3,null,0,null,3.4867071193070364E-3,null,0,null,null,0]
["    Sainte-Sophie",0,0,3200,0.17704646017699116,0,0,13600,0.75082964601769897,1300,7.212389380530973E-2,18100,0,0,18100,null,0,null,1.7704646017699117E-3,null,0,null,7.5082964601769896E-3,null,7.2123893805309735E-4,null,null,0]
["    Saint-Hippolyte",1300,0.12287937013778234,3000,0.27715812166088666,1700,0.16346424219701941,3900,0.36273315212297308,800,7.3765113881338454E-2,10700,0,0,10700,null,1.2287937013778234E-3,null,2.7715812166088667E-3,null,1.6346424219701942E-3,null,3.6273315212297309E-3,null,7.3765113881338459E-4,null,null,0]
["    Saint-Jérôme",2200,2.7900714348048323E-2,11900,0.14811813546432623,27800,0.34667697256055752,8300,0.10401057185244288,27100,0.33765100420131394,77400,2900,3.5642601573311061E-2,80200,null,2.7900714348048325E-4,null,1.4811813546432623E-3,null,3.4667697256055754E-3,null,1.0401057185244287E-3,null,3.3765100420131396E-3,null,null,3.5642601573311063E-4]
["Région des Laurentides",101800,0.16003772991667978,123800,0.19462348687313316,142900,0.22465021223078133,141000,0.22166326049363308,105100,0.16522559346014778,614600,21400,3.3642509039459208E-2,636100,null,1.6003772991667977E-3,null,1.9462348687313317E-3,null,2.2465021223078132E-3,null,2.2166326049363307E-3,null,1.6522559346014778E-3,null,null,3.364250903945921E-4]
["MRC/RLS Argenteuil",1100,3.2504933309665418E-2,4800,0.13800000000000001,700,1.9E-2,12000,0.34600000000000003,14700,0.42200000000000004,33300,1500,4.2999999999999997E-2,34700,null,3.2504933309665421E-4,null,1.3800000000000002E-3,null,1.8999999999999998E-4,null,3.4600000000000004E-3,null,4.2200000000000007E-3,null,null,4.2999999999999999E-4]
["    Brownsburg-Chatham",0,0,1900,0.26065958327583827,700,9.2590037256795904E-2,2000,0.26976680005519527,2700,0.37698357941217053,7200,0,0,7200,null,0,null,2.6065958327583828E-3,null,9.2590037256795902E-4,null,2.6976680005519529E-3,null,3.7698357941217055E-3,null,null,0]
["    Gore",1100,0.49571290132299661,0,0,0,0,1100,0.5042870986770035,0,0,2300,0,0,2300,null,4.957129013229966E-3,null,0,null,0,null,5.0428709867700351E-3,null,0,null,null,0]
["    Grenville",0,0,0,0,0,0,0,0,1800,1,1800,0,0,1800,null,0,null,0,null,0,null,0,null,0.01,null,null,0]
["    Grenville-sur-la-Rouge",0,0,0,0,0,0,2300,0.80298300381546994,600,0.19701699618452997,2900,0,0,2900,null,0,null,0,null,0,null,8.0298300381546998E-3,null,1.9701699618452999E-3,null,null,0]
["    Harrington",0,0,0,0,0,0,1000,1,0,0,1000,0,0,1000,null,0,null,0,null,0,null,0.01,null,0,null,null,0]
["    Lachute",0,0,800,5.3191489361702128E-2,0,0,2300,0.16546099290780142,9500,0.67617021276595746,12600,1500,0.105177304964539,14100,null,0,null,5.3191489361702129E-4,null,0,null,1.6546099290780142E-3,null,6.7617021276595744E-3,null,null,1.05177304964539E-3]
["    Mille-Isles",0,0,900,0.50552004648460203,0,0,900,0.49447995351539803,0,0,1700,0,0,1700,null,0,null,5.0552004648460203E-3,null,0,null,4.9447995351539799E-3,null,0,null,null,0]
["    Saint-André-d'Argenteuil",0,0,600,0.20176875204716674,0,0,2400,0.79823124795283329,0,0,3100,0,0,3100,null,0,null,2.0176875204716673E-3,null,0,null,7.9823124795283321E-3,null,0,null,null,0]
["    Wentworth",0,0,700,1,0,0,0,0,0,0,700,0,0,700,null,0,null,0.01,null,0,null,0,null,0,null,null,0]
["Région des Laurentides",101800,0.16003772991667978,123800,0.19462348687313316,142900,0.22465021223078133,141000,0.22166326049363308,105100,0.16522559346014778,614600,21400,3.3642509039459208E-2,636100,null,1.6003772991667977E-3,null,1.9462348687313317E-3,null,2.2465021223078132E-3,null,2.2166326049363307E-3,null,1.6522559346014778E-3,null,null,3.364250903945921E-4]
["MRC/RLS Les Pays-d'en-Haut",4600,9.8217712019784256E-2,12700,0.27132989383021361,21800,0.46392785571142281,3900,8.3912505862789408E-2,3900,8.2398840233658802E-2,46900,0,2.1319234213107061E-4,46900,null,9.8217712019784266E-4,null,2.7132989383021359E-3,null,4.6392785571142282E-3,null,8.3912505862789412E-4,null,8.2398840233658798E-4,null,null,2.1319234213107061E-6]
["    Estérel",300,1,0,0,0,0,0,0,0,0,300,0,0,300,null,0.01,null,0,null,0,null,0,null,0,null,null,0]
["    Lac-des-Seize-îles",200,1,0,0,0,0,0,0,0,0,200,0,0,200,null,0.01,null,0,null,0,null,0,null,0,null,null,0]
["    Morin-Heights",1100,0.22851646002565201,2700,0.57994869602394183,900,0.19153484395040615,0,0,0,0,4700,0,0,4700,null,2.28516460025652E-3,null,5.7994869602394188E-3,null,1.9153484395040615E-3,null,0,null,0,null,null,0]
["    Piedmont",0,0,800,0.23388952819332565,2700,0.76611047180667446,0,0,0,0,3500,0,0,3500,null,0,null,2.3388952819332564E-3,null,7.6611047180667443E-3,null,0,null,0,null,null,0]
["    Saint-Adolphe-d'Howard",0,0,700,0.1932531380753138,800,0.21548117154811716,1400,0.36532426778242683,900,0.22594142259414227,3800,0,0,3800,null,0,null,1.9325313807531379E-3,null,2.1548117154811717E-3,null,3.6532426778242682E-3,null,2.2594142259414226E-3,null,null,0]
["    Sainte-Adèle",1100,8.0085653104925048E-2,2200,0.15902926481084939,9600,0.68386866523911494,0,0,1100,7.7016416845110638E-2,14000,0,0,14000,null,8.0085653104925044E-4,null,1.5902926481084938E-3,null,6.838686652391149E-3,null,0,null,7.7016416845110641E-4,null,null,0]
["    Sainte-Anne-des-Lacs",0,0,3900,1,0,0,0,0,0,0,3900,0,0,3900,null,0,null,0.01,null,0,null,0,null,0,null,null,0]
["    Sainte-Marguerite-du-Lac-Masson",0,0,800,0.24383724383724384,0,0,1800,0.53786753786753783,700,0.21532521532521531,3400,0,2.9700029700029701E-3,3400,null,0,null,2.4383724383724385E-3,null,0,null,5.3786753786753787E-3,null,2.1532521532521532E-3,null,null,2.9700029700029701E-5]
["    Saint-Sauveur",2000,0.17089810017271156,600,5.2417962003454228E-2,7800,0.6733160621761658,0,0,1200,0.10336787564766839,11600,0,0,11600,null,1.7089810017271157E-3,null,5.2417962003454231E-4,null,6.733160621761658E-3,null,0,null,1.0336787564766839E-3,null,null,0]
["    Wentworth-Nord",0,0,900,0.56459330143540665,0,0,700,0.4354066985645933,0,0,1700,0,0,1700,null,0,null,5.6459330143540662E-3,null,0,null,4.3540669856459331E-3,null,0,null,null,0]
["Région des Laurentides",101800,0.16003772991667978,123800,0.19462348687313316,142900,0.22465021223078133,141000,0.22166326049363308,105100,0.16522559346014778,614600,21400,3.3642509039459208E-2,636100,null,1.6003772991667977E-3,null,1.9462348687313317E-3,null,2.2465021223078132E-3,null,2.2166326049363307E-3,null,1.6522559346014778E-3,null,null,3.364250903945921E-4]
["MRC/RLS Les Laurentides",2800,5.4394706264647381E-2,8800,0.17309017862418025,9100,0.17953010221163124,13400,0.2637611517025425,14800,0.29115544439411545,48800,1900,3.8068416802883198E-2,50800,null,5.4394706264647387E-4,null,1.7309017862418025E-3,null,1.7953010221163123E-3,null,2.6376115170254249E-3,null,2.9115544439411545E-3,null,null,3.8068416802883201E-4]
["    Amherst",0,0,0,0,0,0,1000,0.60185185185185186,700,0.39814814814814814,1700,0,0,1700,null,0,null,0,null,0,null,6.0185185185185185E-3,null,3.9814814814814817E-3,null,null,0]
["    Arundel",0,0,0,0,0,0,0,0,600,1,600,0,0,600,null,0,null,0,null,0,null,0,null,0.01,null,null,0]
["    Barkmere",0,0,0,0,0,0,0,0,0,0,0,100,1,100,null,0,null,0,null,0,null,0,null,0,null,null,0.01]
["    Brébeuf",0,0,0,0,0,0,600,0.554013875123885,500,0.445986124876115,1000,0,0,1000,null,0,null,0,null,0,null,5.5401387512388498E-3,null,4.4598612487611496E-3,null,null,0]
["    Huberdeau",0,0,0,0,0,0,0,0,900,1,900,0,0,900,null,0,null,0,null,0,null,0,null,0.01,null,null,0]
["    Ivry-sur-le-Lac",400,1,0,0,0,0,0,0,0,0,400,0,0,400,null,0.01,null,0,null,0,null,0,null,0,null,null,0]
["    La Conception",0,0,600,0.37851997380484614,0,0,900,0.62148002619515386,0,0,1500,0,0,1500,null,0,null,3.7851997380484613E-3,null,0,null,6.2148002619515389E-3,null,0,null,null,0]
["    La Minerve",0,0,700,0.45812807881773393,0,0,800,0.54187192118226601,0,0,1400,0,0,1400,null,0,null,4.5812807881773394E-3,null,0,null,5.4187192118226599E-3,null,0,null,null,0]
["    Labelle",0,0,800,0.27233273056057866,0,0,1500,0.54575045207956596,500,0.18191681735985538,2800,0,0,2800,null,0,null,2.7233273056057865E-3,null,0,null,5.4575045207956594E-3,null,1.8191681735985538E-3,null,null,0]
["    Lac-Supérieur",0,0,600,0.28346855983772817,0,0,1400,0.71653144016227177,0,0,2000,0,0,2000,null,0,null,2.8346855983772817E-3,null,0,null,7.1653144016227176E-3,null,0,null,null,0]
["    Lac-Tremblant-Nord",0,0,0,0,0,0,0,0,0,0,0,100,1,100,null,0,null,0,null,0,null,0,null,0,null,null,0.01]
["    Lantier",0,0,0,0,0,0,900,1,0,0,900,0,0,900,null,0,null,0,null,0,null,0.01,null,0,null,null,0]
["    Montcalm",0,0,600,1,0,0,0,0,0,0,600,0,0,600,null,0,null,0.01,null,0,null,0,null,0,null,null,0]
["    Mont-Tremblant",1600,0.14637918486171761,1100,9.6160844250363905E-2,2600,0.23981077147016014,0,0,4500,0.41184497816593885,9800,1200,0.1058042212518195,11000,null,{"$f":"C528/100","v":1.4637918486171762E-3},null,{"$f":"E528/100","v":9.6160844250363906E-4},null,{"$f":"G528/100","v":2.3981077147016013E-3},null,{"$f":"I528/100","v":0},null,{"$f":"K528/100","v":4.1184497816593888E-3},null,null,{"$f":"N528/100","v":1.058042212518195E-3}]
["    Sainte-Agathe-des-Monts",0,0,1800,0.16100258674516099,2700,0.24128088484524132,2200,0.19650343412719651,3900,0.34510748372134509,10600,600,5.6105610561056105E-2,11200,null,0,null,1.6100258674516098E-3,null,2.4128088484524132E-3,null,1.9650343412719652E-3,null,3.4510748372134511E-3,null,null,5.6105610561056108E-4]
["    Sainte-Lucie-des-Laurentides",0,0,0,0,0,0,1400,1,0,0,1400,0,0,1400,null,0,null,0,null,0,null,0.01,null,0,null,null,0]
["    Mont-Blanc",800,0.20158730158730159,600,0.15608465608465608,600,0.1492063492063492,1900,0.49312169312169307,0,0,3800,0,0,3800,null,2.0158730158730161E-3,null,1.5608465608465607E-3,null,1.492063492063492E-3,null,4.9312169312169304E-3,null,0,null,null,0]
["    Val-David",0,0,1100,0.19773299748110829,3200,0.57772580064771506,0,0,1200,0.22454120187117665,5600,0,0,5600,null,0,null,1.9773299748110829E-3,null,5.7772580064771508E-3,null,0,null,2.2454120187117665E-3,null,null,0]
["    Val-des-Lacs",0,0,0,0,0,0,800,1,0,0,800,0,0,800,null,0,null,0,null,0,null,0.01,null,0,null,null,0]
["    Val-Morin",0,0,1100,0.34101825168107586,0,0,0,0,2100,0.65898174831892409,3100,0,0,3100,null,0,null,3.4101825168107586E-3,null,0,null,0,null,6.5898174831892408E-3,null,null,0]
["Région des Laurentides",101800,0.16003772991667978,123800,0.19462348687313316,142900,0.22465021223078133,141000,0.22166326049363308,105100,0.16522559346014778,614600,21400,3.3642509039459208E-2,636100,null,1.6003772991667977E-3,null,1.9462348687313317E-3,null,2.2465021223078132E-3,null,2.2166326049363307E-3,null,1.6522559346014778E-3,null,null,3.364250903945921E-4]
["MRC/RLS Antoine-Labelle",700,1.8622127146069881E-2,2000,5.6140639569963249E-2,500,1.3054687071471669E-2,25700,0.7056661730020295,4900,0.13460589106467008,33800,2600,7.1910482145795623E-2,36500,null,1.8622127146069881E-4,null,5.6140639569963254E-4,null,1.3054687071471668E-4,null,7.0566617300202947E-3,null,1.3460589106467009E-3,null,null,7.1910482145795627E-4]
["    Chute-Saint-Philippe",0,0,0,0,0,0,1000,1,0,0,1000,0,0,1000,null,0,null,0,null,0,null,0.01,null,0,null,null,0]
["    Ferme-Neuve",0,0,0,0,0,0,2300,0.84020618556701043,400,0.15979381443298968,2700,0,0,2700,null,0,null,0,null,0,null,8.4020618556701048E-3,null,1.5979381443298967E-3,null,null,0]
["    Kiamika",0,0,0,0,0,0,800,1,0,0,800,0,0,800,null,0,null,0,null,0,null,0.01,null,0,null,null,0]
["    La Macaza",0,0,0,0,0,0,500,0.41590493601462525,0,0,500,600,0.58409506398537481,1100,null,0,null,0,null,0,null,4.1590493601462528E-3,null,0,null,null,5.8409506398537482E-3]
["    Lac-des-Écorces",0,0,0,0,0,0,2300,0.81351819757365684,500,0.18648180242634316,2900,0,0,2900,null,0,null,0,null,0,null,8.1351819757365679E-3,null,1.8648180242634316E-3,null,null,0]
["    Lac-du-Cerf",0,0,0,0,0,0,400,1,0,0,400,0,0,400,null,0,null,0,null,0,null,0.01,null,0,null,null,0]
["    Lac-Saguay",0,0,0,0,0,0,500,1,0,0,500,0,0,500,null,0,null,0,null,0,null,0.01,null,0,null,null,0]
["    Lac-Saint-Paul",0,0,0,0,0,0,500,1,0,0,500,0,0,500,null,0,null,0,null,0,null,0.01,null,0,null,null,0]
["    L'Ascension",0,0,0,0,0,0,900,1,0,0,900,0,0,900,null,0,null,0,null,0,null,0.01,null,0,null,null,0]
["    Mont-Laurier",700,4.8000000000000001E-2,2000,0.14400000000000002,500,3.4000000000000002E-2,6200,0.43942172073342739,2800,0.19527503526093087,12200,2000,0.13949224259520451,14200,null,4.8000000000000001E-4,null,1.4400000000000001E-3,null,3.4000000000000002E-4,null,4.3942172073342736E-3,null,1.9527503526093088E-3,null,null,1.3949224259520452E-3]
["    Mont-Saint-Michel",0,0,0,0,0,0,600,1,0,0,600,0,0,600,null,0,null,0,null,0,null,0.01,null,0,null,null,0]
["    Nominingue",0,0,0,0,0,0,1900,0.85277161862527717,300,0.14722838137472283,2300,0,0,2300,null,0,null,0,null,0,null,8.5277161862527713E-3,null,1.4722838137472282E-3,null,null,0]
["    Notre-Dame-de-Pontmain",0,0,0,0,0,0,800,1,0,0,800,0,0,800,null,0,null,0,null,0,null,0.01,null,0,null,null,0]
["    Notre-Dame-du-Laus",0,0,0,0,0,0,1700,1,0,0,1700,0,0,1700,null,0,null,0,null,0,null,0.01,null,0,null,null,0]
["    Rivière-Rouge",0,0,0,0,0,0,3800,0.81969337076225424,800,0.18030662923774565,4600,0,0,4600,null,0,null,0,null,0,null,8.1969337076225422E-3,null,1.8030662923774565E-3,null,null,0]
["    Saint-Aimé-du-Lac-des-îles",0,0,0,0,0,0,800,1,0,0,800,0,0,800,null,0,null,0,null,0,null,0.01,null,0,null,null,0]
["    Sainte-Anne-du-Lac",0,0,0,0,0,0,600,0.9910873440285205,0,0,600,0,8.9126559714795012E-3,600,null,0,null,0,null,0,null,9.9108734402852047E-3,null,0,null,null,8.9126559714795006E-5]
["   Territoires non organisés","ND","ND","ND","ND","ND","ND","ND","ND","ND","ND","ND","ND","ND","ND"]
[]
["Défavorisation matérielle 2021 MRC  ---- RÉGIONAL ----"]
["Répartition de la population (N, %) par quintile de défavorisation matérielle 2021\nRégion des Laurentides (variation régionale 2021)"]
[null,"Conditions\nplus favorables",null,null,null,null,null,null,null,"Conditions\nplus défavorables",null,"Population avec indice","Population\nsans indice",null,"Population totale"]
[null,"Quintile 1",null,"Quintile 2",null,"Quintile 3",null,"Quintile 4",null,"Quintile 5"]
[null,"N","%","N","%","N","%",null,null,null,null,"N","N","%","N"]
["Région des Laurentides",{"$f":"B562+B571+B580+B583+B590+B601+B613+B635","v":117400},{"$f":"B561/$O561","v":0.18456217575852854},{"$f":"D562+D571+D580+D583+D590+D601+D613+D635","v":128200},{"$f":"D561/$O561","v":0.20154063826442384},{"$f":"F562+F571+F580+F583+F590+F601+F613+F635","v":123000},{"$f":"F561/$O561","v":0.19336582298380758},{"$f":"H562+H571+H580+H583+H590+H601+H613+H635","v":122800},{"$f":"H561/$O561","v":0.19305140701147619},{"$f":"J562+J571+J580+J583+J590+J601+J613+J635","v":123300},{"$f":"J561/$O561","v":0.19383744694230468},{"$f":"L562+L571+L580+L583+L590+L601+L613+L635","v":614600},{"$f":"M562+M571+M580+M583+M590+M601+M613+M635","v":21400},{"$f":"M561/$O561","v":3.3642509039459208E-2},{"$f":"O562+O571+O580+O583+O590+O601+O613+O635","v":636100}]
["MRC Deux-Montagnes",14200,0.13900000000000001,28600,0.28000000000000003,21500,0.21100000000000002,22000,0.21600000000000003,13100,0.128,99400,2600,2.6000000000000002E-2,102100,null,{"$f":"C562/100","v":1.3900000000000002E-3},null,{"$f":"E562/100","v":2.8000000000000004E-3},null,{"$f":"G562/100","v":2.1100000000000003E-3},null,{"$f":"I562/100","v":2.1600000000000005E-3},null,{"$f":"K562/100","v":1.2800000000000001E-3},null,null,{"$f":"N562/100","v":2.6000000000000003E-4}]
["    Deux-Montagnes",4100,0.23097962601172203,4200,0.23298911526653643,6100,0.33999441808540332,2100,0.11521071727602568,500,2.9249232486742952E-2,17000,900,5.1576890873569627E-2,17900,null,{"$f":"C563/100","v":2.3097962601172205E-3},null,{"$f":"E563/100","v":2.3298911526653645E-3},null,{"$f":"G563/100","v":3.3999441808540334E-3},null,{"$f":"I563/100","v":1.1521071727602567E-3},null,{"$f":"K563/100","v":2.924923248674295E-4},null,null,{"$f":"N563/100","v":5.1576890873569628E-4}]
["    Oka",600,0.15045362903225806,1200,0.30090725806451613,1700,0.41658266129032256,0,0,500,0.12953629032258066,4000,0,2.5201612903225806E-3,4000,null,1.5045362903225805E-3,null,3.0090725806451611E-3,null,4.1658266129032256E-3,null,0,null,1.2953629032258066E-3,null,null,2.5201612903225806E-5]
["    Pointe-Calumet",0,0,0,0,500,8.0560420315236414E-2,3900,0.61869129119566946,1900,0.30074828848909407,6300,0,0,6300,null,0,null,0,null,8.0560420315236409E-4,null,6.1869129119566943E-3,null,3.0074828848909406E-3,null,null,0]
["    Sainte-Marthe-sur-le-Lac",700,3.4550689498408851E-2,11300,0.5719553467697126,3900,0.19689851997777441,3500,0.17689548921553772,400,1.9699954538566451E-2,19800,0,0,19800,null,3.455068949840885E-4,null,5.7195534676971263E-3,null,1.9689851997777442E-3,null,1.7689548921553772E-3,null,1.969995453856645E-4,null,null,0]
["    Saint-Eustache",8200,0.18208322289954942,8600,0.19096209912536444,8700,0.19133757399063522,9400,0.20869776482021379,8600,0.18970315398886828,43600,1700,3.721618517536885E-2,45300,null,1.8208322289954943E-3,null,1.9096209912536444E-3,null,1.9133757399063523E-3,null,2.0869776482021381E-3,null,1.8970315398886828E-3,null,null,3.721618517536885E-4]
["    Saint-Joseph-du-Lac",500,7.7087185322144786E-2,2500,0.35883942540179203,700,0.10311477741430806,2600,0.36495519840705448,700,9.6003413454700592E-2,7000,0,0,7000,null,7.7087185322144783E-4,null,3.5883942540179204E-3,null,1.0311477741430806E-3,null,3.6495519840705447E-3,null,9.6003413454700593E-4,null,null,0]
["    Saint-Placide",0,0,700,0.4176008968609865,0,0,600,0.3099775784753363,500,0.27242152466367714,1800,0,0,1800,null,0,null,4.1760089686098652E-3,null,0,null,3.0997757847533629E-3,null,2.7242152466367712E-3,null,null,0]
["Région des Laurentides",117400,0.18456217575852854,128200,0.20154063826442384,123000,0.19336582298380758,122800,0.19305140701147619,123300,0.19383744694230468,614600,21400,3.3642509039459208E-2,636100,null,1.8456217575852855E-3,null,2.0154063826442383E-3,null,1.9336582298380759E-3,null,1.9305140701147618E-3,null,1.9383744694230467E-3,null,null,3.364250903945921E-4]
["MRC/RLS Thérèse-De Blainville",67900,0.41518162706561063,26800,0.16372714383494671,20000,0.12193214041263323,24900,0.15209127798963529,14200,8.6731201720934778E-2,153800,9900,6.033660897623936E-2,163600,null,4.151816270656106E-3,null,1.6372714383494672E-3,null,1.2193214041263322E-3,null,1.5209127798963529E-3,null,8.6731201720934774E-4,null,null,6.0336608976239363E-4]
["    Blainville",27900,0.46565472508734684,12200,0.20446680820475099,7500,0.12554539527574851,6000,9.9466724619268129E-2,1500,2.5710894531837711E-2,55100,4700,7.9155452281047825E-2,59800,null,4.6565472508734683E-3,null,2.0446680820475098E-3,null,1.255453952757485E-3,null,9.9466724619268134E-4,null,2.571089453183771E-4,null,null,7.9155452281047826E-4]
["    Boisbriand",10400,0.36759926522537806,3100,0.10788469690546842,3000,0.10580048042956054,8300,0.29203758654797229,3600,0.12667797089162075,28300,0,0,28300,null,3.6759926522537804E-3,null,1.0788469690546842E-3,null,1.0580048042956054E-3,null,2.9203758654797228E-3,null,1.2667797089162074E-3,null,null,0]
["    Bois-des-Filion",3100,0.30475440496111822,1200,0.12058273452111429,3200,0.31105423762181317,1700,0.16251599566886504,700,6.7526331331823994E-2,9800,300,3.3566295895265282E-2,10200,null,3.047544049611182E-3,null,1.2058273452111429E-3,null,3.1105423762181317E-3,null,1.6251599566886503E-3,null,6.752633133182399E-4,null,null,3.3566295895265283E-4]
["    Lorraine",8100,0.85129446432330047,1400,0.14870553567669964,0,0,0,0,0,0,9500,0,0,9500,null,8.5129446432330048E-3,null,1.4870553567669963E-3,null,0,null,0,null,0,null,null,0]
["    Rosemère",10700,0.75684882895670702,3400,0.24315117104329309,0,0,0,0,0,0,14100,0,0,14100,null,7.5684882895670699E-3,null,2.4315117104329307E-3,null,0,null,0,null,0,null,null,0]
["    Sainte-Anne-des-Plaines",500,3.3506339925103476E-2,800,5.203337494251363E-2,1300,8.2714670520990741E-2,5100,0.33729715524604165,5900,0.38880494054267134,13600,1600,0.10564351882267919,15200,null,3.3506339925103477E-4,null,5.2033374942513631E-4,null,8.2714670520990735E-4,null,3.3729715524604166E-3,null,3.8880494054267132E-3,null,null,1.0564351882267919E-3]
["    Sainte-Thérèse",7300,0.27576979610296609,4700,0.17525345795801456,5000,0.18949986808879507,3900,0.14642143745524441,2500,9.2865488259902762E-2,23300,3200,0.12018995213507708,26500,null,2.7576979610296607E-3,null,1.7525345795801456E-3,null,1.8949986808879508E-3,null,1.4642143745524441E-3,null,9.2865488259902761E-4,null,null,1.2018995213507707E-3]
["Région des Laurentides",117400,0.18456217575852854,128200,0.20154063826442384,123000,0.19336582298380758,122800,0.19305140701147619,123300,0.19383744694230468,614600,21400,3.3642509039459208E-2,636100,null,1.8456217575852855E-3,null,2.0154063826442383E-3,null,1.9336582298380759E-3,null,1.9305140701147618E-3,null,1.9383744694230467E-3,null,null,3.364250903945921E-4]
["Mirabel",7000,0.115,25500,0.41700000000000004,14400,0.23499999999999999,9000,0.14800000000000002,5200,8.5999999999999993E-2,61100,0,0,61100,null,1.15E-3,null,4.1700000000000001E-3,null,2.3499999999999997E-3,null,1.4800000000000002E-3,null,8.5999999999999998E-4,null,null,0]
["    Mirabel",7000,0.115,25500,0.41700000000000004,14400,0.23499999999999999,9000,0.14800000000000002,5200,8.5999999999999993E-2,61100,0,0,61100,null,1.15E-3,null,4.1700000000000001E-3,null,2.3499999999999997E-3,null,1.4800000000000002E-3,null,8.5999999999999998E-4,null,null,0]
["Région des Laurentides",117400,0.18456217575852854,128200,0.20154063826442384,123000,0.19336582298380758,122800,0.19305140701147619,123300,0.19383744694230468,614600,21400,3.3642509039459208E-2,636100,null,1.8456217575852855E-3,null,2.0154063826442383E-3,null,1.9336582298380759E-3,null,1.9305140701147618E-3,null,1.9383744694230467E-3,null,null,3.364250903945921E-4]
["MRC la Rivière-du-Nord",9900,7.2999999999999995E-2,24000,0.17100000000000001,39200,0.27899999999999997,35600,0.253,28900,0.20600000000000002,137500,2900,0.02,140400,null,7.2999999999999996E-4,null,1.7100000000000001E-3,null,2.7899999999999995E-3,null,2.5300000000000001E-3,null,2.0600000000000002E-3,null,null,2.0000000000000001E-4]
["    Prévost",3300,0.24174700555068654,4600,0.33939526730937769,2400,0.17586912065439672,3300,0.24298860648553899,0,0,13700,0,0,13700,null,2.4174700555068653E-3,null,3.3939526730937769E-3,null,1.7586912065439672E-3,null,2.4298860648553897E-3,null,0,null,null,0]
["    Saint-Colomban",400,2.423281172300025E-2,4500,0.25103705163099221,6700,0.3760594247153039,5400,0.30482622932490316,800,4.3844482605800456E-2,17700,0,0,17700,null,2.4232811723000249E-4,null,2.5103705163099219E-3,null,3.7605942471530388E-3,null,3.0482622932490318E-3,null,4.3844482605800457E-4,null,null,0]
["    Sainte-Sophie",0,0,0,0,3200,0.17704646017699116,8800,0.48761061946902656,6100,0.33534292035398233,18100,0,0,18100,null,0,null,0,null,1.7704646017699117E-3,null,4.8761061946902655E-3,null,3.3534292035398232E-3,null,null,0]
["    Saint-Hippolyte",2000,0.18361608398162901,2200,0.20254944230949479,1900,0.17733620770456462,4700,0.43649826600431152,0,0,10700,0,0,10700,null,1.8361608398162902E-3,null,2.025494423094948E-3,null,1.7733620770456462E-3,null,4.3649826600431155E-3,null,0,null,null,0]
["    Saint-Jérôme",4200,5.2036452944036506E-2,12700,0.15877725555707928,25000,0.3118821138718163,13400,0.16656901001084612,22100,0.27509256604291077,77400,2900,3.5642601573311061E-2,80200,null,5.2036452944036508E-4,null,1.5877725555707928E-3,null,3.1188211387181632E-3,null,1.6656901001084613E-3,null,2.7509256604291077E-3,null,null,3.5642601573311063E-4]
["Région des Laurentides",117400,0.18456217575852854,128200,0.20154063826442384,123000,0.19336582298380758,122800,0.19305140701147619,123300,0.19383744694230468,614600,21400,3.3642509039459208E-2,636100,null,1.8456217575852855E-3,null,2.0154063826442383E-3,null,1.9336582298380759E-3,null,1.9305140701147618E-3,null,1.9383744694230467E-3,null,null,3.364250903945921E-4]
["MRC/RLS Argenteuil",0,0,3200,9.2825882199633336E-2,3400,9.7330844058144794E-2,6500,0.18841662804514306,20100,0.57874727203113296,33300,1500,4.2679373665945805E-2,34700,null,0,null,9.2825882199633336E-4,null,9.7330844058144794E-4,null,1.8841662804514306E-3,null,5.7874727203113298E-3,null,null,4.2679373665945806E-4]
["    Brownsburg-Chatham",0,0,700,9.1624120325651995E-2,1900,0.26162550020698222,800,0.10349109976542017,3900,0.54325927970194565,7200,0,0,7200,null,0,null,9.1624120325651994E-4,null,2.6162550020698222E-3,null,1.0349109976542017E-3,null,5.4325927970194565E-3,null,null,0]
["    Gore",0,0,1100,0.49571290132299661,0,0,0,0,1100,0.5042870986770035,2300,0,0,2300,null,0,null,4.957129013229966E-3,null,0,null,0,null,5.0428709867700351E-3,null,null,0]
["    Grenville",0,0,0,0,0,0,1000,0.56057268722466957,800,0.43942731277533037,1800,0,0,1800,null,0,null,0,null,0,null,5.605726872246696E-3,null,4.3942731277533034E-3,null,null,0]
["    Grenville-sur-la-Rouge",0,0,0,0,0,0,600,0.19701699618452997,2300,0.80298300381546994,2900,0,0,2900,null,0,null,0,null,0,null,1.9701699618452999E-3,null,8.0298300381546998E-3,null,null,0]
["    Harrington",0,0,0,0,0,0,0,0,1000,1,1000,0,0,1000,null,0,null,0,null,0,null,0,null,0.01,null,null,0]
["    Lachute",0,0,800,5.3191489361702128E-2,0,0,2700,0.18822695035460993,9200,0.65340425531914892,12600,1500,0.105177304964539,14100,null,0,null,5.3191489361702129E-4,null,0,null,1.8822695035460993E-3,null,6.5340425531914895E-3,null,null,1.05177304964539E-3]
["    Mille-Isles",0,0,0,0,900,0.50552004648460203,900,0.49447995351539803,0,0,1700,0,0,1700,null,0,null,0,null,5.0552004648460203E-3,null,4.9447995351539799E-3,null,0,null,null,0]
["    Saint-André-d'Argenteuil",0,0,0,0,600,0.20176875204716674,700,0.23124795283327873,1700,0.56698329511955459,3100,0,0,3100,null,0,null,0,null,2.0176875204716673E-3,null,2.3124795283327873E-3,null,5.6698329511955456E-3,null,null,0]
["    Wentworth",0,0,700,1,0,0,0,0,0,0,700,0,0,700,null,0,null,0.01,null,0,null,0,null,0,null,null,0]
["Région des Laurentides",117400,0.18456217575852854,128200,0.20154063826442384,123000,0.19336582298380758,122800,0.19305140701147619,123300,0.19383744694230468,614600,21400,3.3642509039459208E-2,636100,null,1.8456217575852855E-3,null,2.0154063826442383E-3,null,1.9336582298380759E-3,null,1.9305140701147618E-3,null,1.9383744694230467E-3,null,null,3.364250903945921E-4]
["MRC/RLS Les Pays-d'en-Haut",15600,0.33187651899543769,14100,0.30153924871018634,9400,0.20005969385579669,4500,9.6064469364260441E-2,3300,7.0246876732187782E-2,46900,0,2.1319234213107061E-4,46900,null,3.3187651899543769E-3,null,3.0153924871018632E-3,null,2.0005969385579669E-3,null,9.6064469364260437E-4,null,7.0246876732187784E-4,null,null,2.1319234213107061E-6]
["    Estérel",300,1,0,0,0,0,0,0,0,0,300,0,0,300,null,0.01,null,0,null,0,null,0,null,0,null,null,0]
["    Lac-des-Seize-îles",0,0,200,1,0,0,0,0,0,0,200,0,0,200,null,0,null,0.01,null,0,null,0,null,0,null,null,0]
["    Morin-Heights",2900,0.63018383924754173,1700,0.36981616075245832,0,0,0,0,0,0,4700,0,0,4700,null,6.3018383924754173E-3,null,3.6981616075245833E-3,null,0,null,0,null,0,null,null,0]
["    Piedmont",1300,0.38607594936708867,2100,0.61392405063291144,0,0,0,0,0,0,3500,0,0,3500,null,3.8607594936708868E-3,null,6.1392405063291147E-3,null,0,null,0,null,0,null,null,0]
["    Saint-Adolphe-d'Howard",700,0.1932531380753138,0,0,800,0.21548117154811716,1600,0.41788702928870292,700,0.17337866108786615,3800,0,0,3800,null,1.9325313807531379E-3,null,0,null,2.1548117154811717E-3,null,4.1788702928870292E-3,null,1.7337866108786614E-3,null,null,0]
["    Sainte-Adèle",3900,0.27723054960742327,3500,0.25024982155603143,5500,0.39550321199143468,0,0,1100,7.7016416845110638E-2,14000,0,0,14000,null,2.7723054960742326E-3,null,2.5024982155603141E-3,null,3.9550321199143465E-3,null,0,null,7.7016416845110641E-4,null,null,0]
["    Sainte-Anne-des-Lacs",3200,0.832470222682548,0,0,600,0.16752977731745211,0,0,0,0,3900,0,0,3900,null,8.3247022268254801E-3,null,0,null,1.675297773174521E-3,null,0,null,0,null,null,0]
["    Sainte-Marguerite-du-Lac-Masson",0,0,0,0,800,0.24383724383724384,1700,0.50816750816750822,800,0.245025245025245,3400,0,2.9700029700029701E-3,3400,null,0,null,0,null,2.4383724383724385E-3,null,5.0816750816750824E-3,null,2.4502524502524499E-3,null,null,2.9700029700029701E-5]
["    Saint-Sauveur",3200,0.27435233160621764,6600,0.56986183074265973,600,5.2417962003454228E-2,1200,0.10336787564766839,0,0,11600,0,0,11600,null,2.7435233160621763E-3,null,5.6986183074265971E-3,null,5.2417962003454231E-4,null,1.0336787564766839E-3,null,0,null,null,0]
["    Wentworth-Nord",0,0,0,0,900,0.56459330143540665,0,0,700,0.4354066985645933,1700,0,0,1700,null,0,null,0,null,5.6459330143540662E-3,null,0,null,4.3540669856459331E-3,null,null,0]
["Région des Laurentides",117400,0.18456217575852854,128200,0.20154063826442384,123000,0.19336582298380758,122800,0.19305140701147619,123300,0.19383744694230468,614600,21400,3.3642509039459208E-2,636100,null,1.8456217575852855E-3,null,2.0154063826442383E-3,null,1.9336582298380759E-3,null,1.9305140701147618E-3,null,1.9383744694230467E-3,null,null,3.364250903945921E-4]
["MRC/RLS Les Laurentides",2800,5.573389526754239E-2,5300,0.10392500541583788,12600,0.2473560864170786,14100,0.27847253677846268,14000,0.27644405931819527,48800,1900,3.8068416802883198E-2,50800,null,5.573389526754239E-4,null,1.0392500541583788E-3,null,2.4735608641707858E-3,null,2.7847253677846266E-3,null,2.7644405931819527E-3,null,null,3.8068416802883201E-4]
["    Amherst",0,0,0,0,0,0,0,0,1700,1,1700,0,0,1700,null,0,null,0,null,0,null,0,null,0.01,null,null,0]
["    Arundel",0,0,0,0,0,0,600,1,0,0,600,0,0,600,null,0,null,0,null,0,null,0.01,null,0,null,null,0]
["    Barkmere",0,0,0,0,0,0,0,0,0,0,0,100,1,100,null,0,null,0,null,0,null,0,null,0,null,null,0.01]
["    Brébeuf",0,0,0,0,0,0,500,0.445986124876115,600,0.554013875123885,1000,0,0,1000,null,0,null,0,null,0,null,4.4598612487611496E-3,null,5.5401387512388498E-3,null,null,0]
["    Huberdeau",0,0,0,0,0,0,500,0.5330243337195828,400,0.46697566628041715,900,0,0,900,null,0,null,0,null,0,null,5.3302433371958278E-3,null,4.6697566628041715E-3,null,null,0]
["    Ivry-sur-le-Lac",400,1,0,0,0,0,0,0,0,0,400,0,0,400,null,0.01,null,0,null,0,null,0,null,0,null,null,0]
["    La Conception",0,0,0,0,600,0.37851997380484614,0,0,900,0.62148002619515386,1500,0,0,1500,null,0,null,0,null,3.7851997380484613E-3,null,0,null,6.2148002619515389E-3,null,null,0]
["    La Minerve",0,0,0,0,700,0.45812807881773393,800,0.54187192118226601,0,0,1400,0,0,1400,null,0,null,0,null,4.5812807881773394E-3,null,5.4187192118226599E-3,null,0,null,null,0]
["    Labelle",0,0,0,0,800,0.27233273056057866,900,0.33200723327305603,1100,0.3956600361663653,2800,0,0,2800,null,0,null,0,null,2.7233273056057865E-3,null,3.3200723327305604E-3,null,3.9566003616636532E-3,null,null,0]
["    Lac-Supérieur",0,0,0,0,600,0.28346855983772817,800,0.38083164300202837,700,0.3356997971602434,2000,0,0,2000,null,0,null,0,null,2.8346855983772817E-3,null,3.8083164300202837E-3,null,3.3569979716024339E-3,null,null,0]
["    Lac-Tremblant-Nord",0,0,0,0,0,0,0,0,0,0,0,100,1,100,null,0,null,0,null,0,null,0,null,0,null,null,0.01]
["    Lantier",0,0,0,0,0,0,0,0,900,1,900,0,0,900,null,0,null,0,null,0,null,0,null,0.01,null,null,0]
["    Montcalm",0,0,0,0,600,1,0,0,0,0,600,0,0,600,null,0,null,0,null,0.01,null,0,null,0,null,null,0]
["    Mont-Tremblant",2400,0.22188864628820962,800,7.4508733624454149E-2,2000,0.18595342066957787,3100,0.2802037845705968,1400,0.13164119359534207,9800,1200,0.1058042212518195,11000,null,{"$f":"C627/100","v":2.2188864628820961E-3},null,{"$f":"E627/100","v":7.450873362445415E-4},null,{"$f":"G627/100","v":1.8595342066957787E-3},null,{"$f":"I627/100","v":2.8020378457059682E-3},null,{"$f":"K627/100","v":1.3164119359534206E-3},null,null,{"$f":"N627/100","v":1.058042212518195E-3}]
["    Sainte-Agathe-des-Monts",0,0,700,6.2706270627062702E-2,3800,0.3395772009633396,1800,0.15823744536615825,4300,0.3833734724823834,10600,600,5.6105610561056105E-2,11200,null,0,null,6.2706270627062701E-4,null,3.3957720096333961E-3,null,1.5823744536615824E-3,null,3.8337347248238339E-3,null,null,5.6105610561056108E-4]
["    Sainte-Lucie-des-Laurentides",0,0,0,0,0,0,700,0.46228373702422149,800,0.53771626297577857,1400,0,0,1400,null,0,null,0,null,0,null,4.6228373702422148E-3,null,5.3771626297577854E-3,null,null,0]
["    Mont-Blanc",0,0,1400,0.35767195767195775,600,0.1492063492063492,600,0.16798941798941802,1200,0.32513227513227511,3800,0,0,3800,null,0,null,3.5767195767195774E-3,null,1.492063492063492E-3,null,1.6798941798941802E-3,null,3.251322751322751E-3,null,null,0]
["    Val-David",0,0,2400,0.4323497661029147,1900,0.34310903202590859,1200,0.22454120187117665,0,0,5600,0,0,5600,null,0,null,4.3234976610291471E-3,null,3.4310903202590861E-3,null,2.2454120187117665E-3,null,0,null,null,0]
["    Val-des-Lacs",0,0,0,0,0,0,800,1,0,0,800,0,0,800,null,0,null,0,null,0,null,0.01,null,0,null,null,0]
["    Val-Morin",0,0,0,0,1100,0.34101825168107586,2100,0.65898174831892409,0,0,3100,0,0,3100,null,0,null,0,null,3.4101825168107586E-3,null,6.5898174831892408E-3,null,0,null,null,0]
["Région des Laurentides",117400,0.18456217575852854,128200,0.20154063826442384,123000,0.19336582298380758,122800,0.19305140701147619,123300,0.19383744694230468,614600,21400,3.3642509039459208E-2,636100,null,1.8456217575852855E-3,null,2.0154063826442383E-3,null,1.9336582298380759E-3,null,1.9305140701147618E-3,null,1.9383744694230467E-3,null,null,3.364250903945921E-4]
["MRC/RLS Antoine-Labelle",0,0,700,1.8622127146069881E-2,2500,6.9195326641434921E-2,6200,0.16869617684164337,24500,0.67157588722505623,33800,2600,7.1910482145795623E-2,36500,null,0,null,1.8622127146069881E-4,null,6.9195326641434917E-4,null,1.6869617684164336E-3,null,6.7157588722505622E-3,null,null,7.1910482145795627E-4]
["    Chute-Saint-Philippe",0,0,0,0,0,0,0,0,1000,1,1000,0,0,1000,null,0,null,0,null,0,null,0,null,0.01,null,null,0]
["    Ferme-Neuve",0,0,0,0,0,0,400,0.14653902798232696,2300,0.85346097201767313,2700,0,0,2700,null,0,null,0,null,0,null,1.4653902798232696E-3,null,8.534609720176731E-3,null,null,0]
["    Kiamika",0,0,0,0,0,0,0,0,800,1,800,0,0,800,null,0,null,0,null,0,null,0,null,0.01,null,null,0]
["    La Macaza",0,0,0,0,0,0,0,0,500,0.41590493601462525,500,600,0.58409506398537481,1100,null,0,null,0,null,0,null,0,null,4.1590493601462528E-3,null,null,5.8409506398537482E-3]
["    Lac-des-Écorces",0,0,0,0,0,0,500,0.18890814558058924,2300,0.81109185441941078,2900,0,0,2900,null,0,null,0,null,0,null,1.8890814558058925E-3,null,8.1109185441941081E-3,null,null,0]
["    Lac-du-Cerf",0,0,0,0,0,0,0,0,400,1,400,0,0,400,null,0,null,0,null,0,null,0,null,0.01,null,null,0]
["    Lac-Saguay",0,0,0,0,0,0,0,0,500,1,500,0,0,500,null,0,null,0,null,0,null,0,null,0.01,null,null,0]
["    Lac-Saint-Paul",0,0,0,0,0,0,0,0,500,1,500,0,0,500,null,0,null,0,null,0,null,0,null,0.01,null,null,0]
["    L'Ascension",0,0,0,0,0,0,0,0,900,1,900,0,0,900,null,0,null,0,null,0,null,0,null,0.01,null,null,0]
["    Mont-Laurier",0,0,700,4.7884344146685472E-2,2500,0.17792665726375176,2700,0.18702397743300422,6300,0.44767277856135401,12200,2000,0.13949224259520451,14200,null,0,null,4.7884344146685473E-4,null,1.7792665726375175E-3,null,1.8702397743300422E-3,null,4.4767277856135402E-3,null,null,1.3949224259520452E-3]
["    Mont-Saint-Michel",0,0,0,0,0,0,0,0,600,1,600,0,0,600,null,0,null,0,null,0,null,0,null,0.01,null,null,0]
["    Nominingue",0,0,0,0,0,0,700,0,1500,1,2300,0,0,2300,null,0,null,0,null,0,null,0,null,0.01,null,null,0]
["    Notre-Dame-de-Pontmain",0,0,0,0,0,0,0,0.32283813747228379,800,0.67716186252771626,800,0,0,800,null,0,null,0,null,0,null,3.228381374722838E-3,null,6.7716186252771626E-3,null,null,0]
["    Notre-Dame-du-Laus",0,0,0,0,0,0,500,0,1200,1,1700,0,0,1700,null,0,null,0,null,0,null,0,null,0.01,null,null,0]
["    Rivière-Rouge",0,0,0,0,0,0,1300,0.28728323699421965,3300,0.71271676300578035,4600,0,0,4600,null,0,null,0,null,0,null,2.8728323699421963E-3,null,7.1271676300578039E-3,null,null,0]
["    Saint-Aimé-du-Lac-des-îles",0,0,0,0,0,0,0,0.28741092636579574,800,0.71258907363420432,800,0,0,800,null,0,null,0,null,0,null,2.8741092636579576E-3,null,7.1258907363420431E-3,null,null,0]
["    Sainte-Anne-du-Lac",0,0,0,0,0,0,0,0,600,0.9910873440285205,600,0,8.9126559714795012E-3,600,null,0,null,0,null,0,null,0,null,9.9108734402852047E-3,null,null,8.9126559714795006E-5]
["   Territoires non organisés","ND","ND","ND","ND","ND","ND","ND","ND","ND","ND","ND","ND","ND","ND",null,{"$error":"#VALUE!"},null,{"$error":"#VALUE!"},null,{"$error":"#VALUE!"},null,{"$error":"#VALUE!"},null,{"$error":"#VALUE!"},null,null,{"$error":"#VALUE!"}]
[]
["Défavorisation sociale 2021 MRC  ---- RÉGIONAL ----"]
["Répartition de la population (N, %) par quintile de défavorisation sociale 2021\nRégion des Laurentides (variation régionale 2021)"]
[null,"Conditions\nplus favorables",null,null,null,null,null,null,null,"Conditions\nplus défavorables",null,"Population avec indice","Population\nsans indice",null,"Population totale"]
[null,"Quintile 1",null,"Quintile 2",null,"Quintile 3",null,"Quintile 4",null,"Quintile 5"]
[null,"N","%","N","%","N","%",null,null,null,null,"N","N","%","N"]
["Région des Laurentides",{"$f":"B661+B670+B679+B682+B689+B700+B712+B734","v":122900},{"$f":"B660/$O660","v":0.19320861499764189},{"$f":"D661+D670+D679+D682+D689+D700+D712+D734","v":122400},{"$f":"D660/$O660","v":0.1924225750668134},{"$f":"F661+F670+F679+F682+F689+F700+F712+F734","v":121600},{"$f":"F660/$O660","v":0.19116491117748782},{"$f":"H661+H670+H679+H682+H689+H700+H712+H734","v":124200},{"$f":"H660/$O660","v":0.19525231881779595},{"$f":"J661+J670+J679+J682+J689+J700+J712+J734","v":123700},{"$f":"J660/$O660","v":0.19446627888696746},{"$f":"L661+L670+L679+L682+L689+L700+L712+L734","v":614600.46399999992},{"$f":"M661+M670+M679+M682+M689+M700+M712+M734","v":21400},{"$f":"M660/$O660","v":3.3642509039459208E-2},{"$f":"O661+O670+O679+O682+O689+O700+O712+O734","v":636100}]
["MRC Deux-Montagnes",22300,0.2188786109042449,27400,0.26856896484145337,17500,0.17177517344099086,14800,0.14501430643201504,17400,0.1700995570885431,99400,2600,2.6000000000000002E-2,102100,null,{"$f":"C661/100","v":2.188786109042449E-3},null,{"$f":"E661/100","v":2.6856896484145337E-3},null,{"$f":"G661/100","v":1.7177517344099085E-3},null,{"$f":"I661/100","v":1.4501430643201504E-3},null,{"$f":"K661/100","v":1.700995570885431E-3},null,null,{"$f":"N661/100","v":2.6000000000000003E-4}]
["    Deux-Montagnes",2800,0.15662852358358917,3400,0.18816634105498189,2600,0.14496232207647222,2800,0.1574099916271281,5400,0.301255930784259,17000,900,5.1576890873569627E-2,17900,null,{"$f":"C662/100","v":1.5662852358358918E-3},null,{"$f":"E662/100","v":1.881663410549819E-3},null,{"$f":"G662/100","v":1.4496232207647222E-3},null,{"$f":"I662/100","v":1.5740999162712809E-3},null,{"$f":"K662/100","v":3.0125593078425901E-3},null,null,{"$f":"N662/100","v":5.1576890873569628E-4}]
["    Oka",600,0.15650201612903225,2800,0.7036290322580645,0,0,500,0.13734879032258066,0,0,3900,0,2.5201612903225806E-3,4000,null,1.5650201612903225E-3,null,7.0362903225806451E-3,null,0,null,1.3734879032258065E-3,null,0,null,null,2.5201612903225806E-5]
["    Pointe-Calumet",500,8.6451202037892069E-2,2800,0.43798758159528739,0,0,1600,0.25680624104441968,1400,0.2187549753224009,6300,0,0,6300,null,8.6451202037892067E-4,null,4.3798758159528739E-3,null,0,null,2.5680624104441967E-3,null,2.1875497532240092E-3,null,null,0]
["    Sainte-Marthe-sur-le-Lac",1200,6.2332676668182048E-2,7200,0.36409557003586401,8100,0.41046623225741269,3200,0.1631055210385412,0,0,19700,0,0,19800,null,6.2332676668182046E-4,null,3.64095570035864E-3,null,4.1046623225741265E-3,null,1.631055210385412E-3,null,0,null,null,0]
["    Saint-Eustache",13900,0.30795564979238449,8700,0.19188974291015107,5300,0.11787702093824542,5000,0.11120682039049386,10600,0.2338545807933563,43500,1700,3.721618517536885E-2,45300,null,3.0795564979238447E-3,null,1.9188974291015108E-3,null,1.1787702093824543E-3,null,1.1120682039049386E-3,null,2.338545807933563E-3,null,null,3.721618517536885E-4]
["    Saint-Joseph-du-Lac",3200,0.45370502062295548,1600,0.22173232826056041,700,0.10311477741430806,1600,0.22144787370217606,0,0,7100,0,0,7000,null,4.5370502062295551E-3,null,2.2173232826056041E-3,null,1.0311477741430806E-3,null,2.2144787370217607E-3,null,0,null,null,0]
["    Saint-Placide",0,0,1000,0.58239910313901344,700,0.4176008968609865,0,0,0,0,1700,0,0,1800,null,0,null,5.8239910313901341E-3,null,4.1760089686098652E-3,null,0,null,0,null,null,0]
["Région des Laurentides",122900,0.19320861499764189,122400,0.1924225750668134,121600,0.19116491117748782,124200,0.19525231881779595,123700,0.19446627888696746,614600.46399999992,21400,3.3642509039459208E-2,636100,null,1.9320861499764188E-3,null,1.9242257506681341E-3,null,1.9116491117748783E-3,null,1.9525231881779596E-3,null,1.9446627888696747E-3,null,null,3.364250903945921E-4]
["MRC/RLS Thérèse-De Blainville",53300,0.32557201525374002,21700,0.13256575730908379,20000,0.12205436589420163,23800,0.14566221765913759,35000,0.21380903490759753,153800,9900,6.033660897623936E-2,163600,null,3.2557201525374004E-3,null,1.3256575730908379E-3,null,1.2205436589420163E-3,null,1.4566221765913759E-3,null,2.1380903490759752E-3,null,null,6.0336608976239363E-4]
["    Blainville",19500,0.32633444223407276,10300,0.1722028118156439,8900,0.14903291596315552,11200,0.18805061936842807,5100,8.5223758337651917E-2,55000,4700,7.9155452281047825E-2,59800,null,3.2633444223407275E-3,null,1.7220281181564391E-3,null,1.4903291596315552E-3,null,1.8805061936842807E-3,null,8.5223758337651912E-4,null,null,7.9155452281047826E-4]
["    Boisbriand",9000,0.3174720926946446,5200,0.18464744948424475,1900,6.8213932457255905E-2,4900,0.17309594460929772,7300,0.25657058075455702,28300,0,0,28300,null,3.174720926946446E-3,null,1.8464744948424475E-3,null,6.8213932457255905E-4,null,1.7309594460929772E-3,null,2.5657058075455701E-3,null,null,0]
["    Bois-des-Filion",1000,0.10286445516290973,500,5.1383010138793185E-2,2400,0.23191258982183285,1100,0.10365193424549661,4800,0.47662171473570231,9800,300,3.3566295895265282E-2,10200,null,1.0286445516290974E-3,null,5.1383010138793186E-4,null,2.3191258982183287E-3,null,1.0365193424549661E-3,null,4.766217147357023E-3,null,null,3.3566295895265283E-4]
["    Lorraine",6600,0.69616922753104604,2100,0.21669122290044199,400,4.3990738791833295E-2,400,4.3148810776678592E-2,0,0,9500,0,0,9500,null,6.9616922753104604E-3,null,2.16691222900442E-3,null,4.3990738791833294E-4,null,4.3148810776678595E-4,null,0,null,null,0]
["    Rosemère",8200,0.58545067423704755,1000,7.2888573456352024E-2,1600,0.11156848828956707,2100,0.14939673527324343,1100,8.0695528743789921E-2,14000,0,0,14100,null,5.8545067423704756E-3,null,7.2888573456352022E-4,null,1.1156848828956707E-3,null,1.4939673527324343E-3,null,8.0695528743789926E-4,null,null,0]
["    Sainte-Anne-des-Plaines",5700,0.37139478352276462,1800,0.11700939491492017,2400,0.15557453518165693,2000,0.13290848170291045,1800,0.11746928585506866,13700,1600,0.10564351882267919,15200,null,3.7139478352276462E-3,null,1.1700939491492016E-3,null,1.5557453518165692E-3,null,1.3290848170291044E-3,null,1.1746928585506867E-3,null,null,1.0564351882267919E-3]
["    Sainte-Thérèse",3200,0.12075528587042551,800,2.9208909659669092E-2,2400,9.0905664644028189E-2,2100,7.8958278370331286E-2,14900,0.55998190932046887,23400,3200,0.12018995213507708,26500,null,1.207552858704255E-3,null,2.9208909659669092E-4,null,9.0905664644028194E-4,null,7.895827837033129E-4,null,5.5998190932046886E-3,null,null,1.2018995213507707E-3]
["Région des Laurentides",122900,0.19320861499764189,122400,0.1924225750668134,121600,0.19116491117748782,124200,0.19525231881779595,123700,0.19446627888696746,614600.46399999992,21400,3.3642509039459208E-2,636100,null,1.9320861499764188E-3,null,1.9242257506681341E-3,null,1.9116491117748783E-3,null,1.9525231881779596E-3,null,1.9446627888696747E-3,null,null,3.364250903945921E-4]
["Mirabel",5900,9.6000000000000002E-2,10400,0.17,22000,0.35899999999999999,17400,0.28499999999999998,5500,0.09,61200,0,2.0363460200183286E-4,61100,null,9.6000000000000002E-4,null,1.7000000000000001E-3,null,3.5899999999999999E-3,null,2.8499999999999997E-3,null,8.9999999999999998E-4,null,null,2.0363460200183285E-6]
["    Mirabel",5900,9.6000000000000002E-2,10400,0.17,22000,0.35899999999999999,17400,0.28499999999999998,5500,0.09,61200,0,2.0363460200183286E-4,61100,null,9.6000000000000002E-4,null,1.7000000000000001E-3,null,3.5899999999999999E-3,null,2.8499999999999997E-3,null,8.9999999999999998E-4,null,null,2.0363460200183285E-6]
["Région des Laurentides",122900,0.19320861499764189,122400,0.1924225750668134,121600,0.19116491117748782,124200,0.19525231881779595,123700,0.19446627888696746,614600.46399999992,21400,3.3642509039459208E-2,636100,null,1.9320861499764188E-3,null,1.9242257506681341E-3,null,1.9116491117748783E-3,null,1.9525231881779596E-3,null,1.9446627888696747E-3,null,null,3.364250903945921E-4]
["MRC la Rivière-du-Nord",28300,0.2016189114678518,24200,0.1726551906495663,21200,0.15126226102528592,28300,0.20161178888645959,35400,0.25248838777065313,137400,2900,2.0363460200183287E-2,140400,null,2.0161891146785178E-3,null,1.726551906495663E-3,null,1.5126226102528592E-3,null,2.0161178888645961E-3,null,2.5248838777065315E-3,null,null,2.0363460200183286E-4]
["    Prévost",5600,0.41221151037101955,3000,0.22056675430908559,0,0,2700,0.19872918492550398,2300,0.16849255039439087,13600,0,0,13700,null,4.1221151037101958E-3,null,2.2056675430908558E-3,null,0,null,1.98729184925504E-3,null,1.6849255039439086E-3,null,null,0]
["    Saint-Colomban",10800,0.60790544199070629,4600,0.2566162338648923,2400,0.13547832414440142,0,0,0,0,17800,0,0,17700,null,6.0790544199070626E-3,null,2.566162338648923E-3,null,1.3547832414440141E-3,null,0,null,0,null,null,0]
["    Sainte-Sophie",3200,0.17505530973451328,4800,0.26332964601769909,8900,0.48949115044247793,1300,7.212389380530973E-2,0,0,18200,0,0,18100,null,1.7505530973451328E-3,null,2.6332964601769909E-3,null,4.8949115044247789E-3,null,7.2123893805309735E-4,null,0,null,null,0]
["    Saint-Hippolyte",1300,0.12287937013778234,3000,0.28400037491798669,3800,0.35589089886587311,2500,0.23722935607835788,0,0,10600,0,0,10700,null,1.2287937013778234E-3,null,2.8400037491798668E-3,null,3.5589089886587312E-3,null,2.3722935607835786E-3,null,0,null,null,0]
["    Saint-Jérôme",7400,9.2254372732599454E-2,8900,0.11065538005061523,6200,7.7119668881602738E-2,21800,0.27115305499108622,33100,0.4131749217707853,77400,2900,3.5642601573311061E-2,80200,null,9.2254372732599452E-4,null,1.1065538005061524E-3,null,7.7119668881602736E-4,null,2.7115305499108623E-3,null,4.1317492177078531E-3,null,null,3.5642601573311063E-4]
["Région des Laurentides",122900,0.19320861499764189,122400,0.1924225750668134,121600,0.19116491117748782,124200,0.19525231881779595,123700,0.19446627888696746,614600.46399999992,21400,3.3642509039459208E-2,636100,null,1.9320861499764188E-3,null,1.9242257506681341E-3,null,1.9116491117748783E-3,null,1.9525231881779596E-3,null,1.9446627888696747E-3,null,null,3.364250903945921E-4]
["MRC/RLS Argenteuil",1600,4.5154374431469302E-2,8800,0.25208930355320319,7600,0.2191526840635046,7900,0.22614600018004188,7500,0.21477826410583517,33264.464,1500,4.2679373665945805E-2,34700,null,4.5154374431469299E-4,null,2.5208930355320319E-3,null,2.191526840635046E-3,null,2.261460001800419E-3,null,2.1477826410583518E-3,null,null,4.2679373665945806E-4]
["    Brownsburg-Chatham",0,0,700,0.10169725403615289,3100,0.42872912929488066,2800,0.3878846419207948,600,8.1688974748171661E-2,7247,0,0,7200,null,0,null,1.0169725403615288E-3,null,4.2872912929488062E-3,null,3.8788464192079479E-3,null,8.1688974748171661E-4,null,null,0]
["    Gore",0,0,2300,1,0,0,0,0,0,0,2278.4639999999999,0,0,2300,null,0,null,0.01,null,0,null,0,null,0,null,null,0]
["    Grenville",0,0,0,0,0,0,0,0,1800,1,1816,0,0,1800,null,0,null,0,null,0,null,0,null,0.01,null,null,0]
["    Grenville-sur-la-Rouge",0,0,1800,0.627471383975026,500,0.17551161984044397,600,0.19701699618452997,0,0,2883,0,0,2900,null,0,null,6.2747138397502601E-3,null,1.7551161984044397E-3,null,1.9701699618452999E-3,null,0,null,null,0]
["    Harrington",0,0,0,0,1000,1,0,0,0,0,967,0,0,1000,null,0,null,0,null,0.01,null,0,null,0,null,null,0]
["    Lachute",0,0,1400,0.10184397163120568,1600,0.11680851063829788,4500,0.31765957446808513,5100,0.35851063829787239,12617,1500,0.105177304964539,14100,null,0,null,1.0184397163120569E-3,null,1.1680851063829787E-3,null,3.1765957446808512E-3,null,3.5851063829787241E-3,null,null,1.05177304964539E-3]
["    Mille-Isles",900,0.49447995351539803,900,0.50552004648460203,0,0,0,0,0,0,1721,0,0,1700,null,4.9447995351539799E-3,null,5.0552004648460203E-3,null,0,null,0,null,0,null,null,0]
["    Saint-André-d'Argenteuil",700,0.23517851293809364,1600,0.53357353422862763,700,0.23124795283327873,0,0,0,0,3053,0,0,3100,null,2.3517851293809364E-3,null,5.335735342286276E-3,null,2.3124795283327873E-3,null,0,null,0,null,null,0]
["    Wentworth",0,0,0,0,700,1,0,0,0,0,682,0,0,700,null,0,null,0,null,0.01,null,0,null,0,null,null,0]
["Région des Laurentides",122900,0.19320861499764189,122400,0.1924225750668134,121600,0.19116491117748782,124200,0.19525231881779595,123700,0.19446627888696746,614600.46399999992,21400,3.3642509039459208E-2,636100,null,1.9320861499764188E-3,null,1.9242257506681341E-3,null,1.9116491117748783E-3,null,1.9525231881779596E-3,null,1.9446627888696747E-3,null,null,3.364250903945921E-4]
["MRC/RLS Les Pays-d'en-Haut",200,3.7308659872937362E-3,8600,0.18276979490896686,12500,0.26695945081652667,16400,0.35001918731079179,9200,0.19630750863428986,46896,0,2.1319234213107061E-4,46900,null,3.7308659872937361E-5,null,1.8276979490896685E-3,null,2.6695945081652668E-3,null,3.5001918731079177E-3,null,1.9630750863428984E-3,null,null,2.1319234213107061E-6]
["    Estérel",0,0,300,1,0,0,0,0,0,0,262,0,0,300,null,0,null,0.01,null,0,null,0,null,0,null,null,0]
["    Lac-des-Seize-îles",200,1,0,0,0,0,0,0,0,0,175,0,0,200,null,0.01,null,0,null,0,null,0,null,0,null,null,0]
["    Morin-Heights",0,0,1100,0.22851646002565201,2700,0.57994869602394183,900,0.19153484395040615,0,0,4678,0,0,4700,null,0,null,2.28516460025652E-3,null,5.7994869602394188E-3,null,1.9153484395040615E-3,null,0,null,null,0]
["    Piedmont",0,0,0,0,800,0.23388952819332565,1300,0.38607594936708867,1300,0.3800345224395858,3476,0,0,3500,null,0,null,0,null,2.3388952819332564E-3,null,3.8607594936708868E-3,null,3.8003452243958579E-3,null,null,0]
["    Saint-Adolphe-d'Howard",0,0,0,0,2100,0.55857740585774063,1700,0.44142259414225937,0,0,3824,0,0,3800,null,0,null,0,null,5.5857740585774059E-3,null,4.4142259414225934E-3,null,0,null,null,0]
["    Sainte-Adèle",0,0,1900,0.13283369022127053,1500,0.10628122769450393,5700,0.40927908636688082,4900,0.35160599571734474,14010,0,0,14000,null,0,null,1.3283369022127054E-3,null,1.0628122769450394E-3,null,4.0927908636688081E-3,null,3.5160599571734475E-3,null,null,0]
["    Sainte-Anne-des-Lacs",0,0,600,0.16752977731745211,3200,0.832470222682548,0,0,0,0,3862,0,0,3900,null,0,null,1.675297773174521E-3,null,8.3247022268254801E-3,null,0,null,0,null,null,0]
["    Sainte-Marguerite-du-Lac-Masson",0,0,1800,0.53786753786753783,800,0.24383724383724384,700,0.21532521532521531,0,0,3357,0,2.9700029700029701E-3,3400,null,0,null,5.3786753786753787E-3,null,2.4383724383724385E-3,null,2.1532521532521532E-3,null,0,null,null,2.9700029700029701E-5]
["    Saint-Sauveur",0,0,2000,0.17089810017271156,600,5.2417962003454228E-2,6000,0.52098445595854925,3000,0.25569948186528496,11580,0,0,11600,null,0,null,1.7089810017271157E-3,null,5.2417962003454231E-4,null,5.2098445595854925E-3,null,2.5569948186528494E-3,null,null,0]
["    Wentworth-Nord",0,0,900,0.56459330143540665,700,0.4354066985645933,0,0,0,0,1672,0,0,1700,null,0,null,5.6459330143540662E-3,null,4.3540669856459331E-3,null,0,null,0,null,null,0]
["Région des Laurentides",122900,0.19320861499764189,122400,0.1924225750668134,121600,0.19116491117748782,124200,0.19525231881779595,123700,0.19446627888696746,614600.46399999992,21400,3.3642509039459208E-2,636100,null,1.9320861499764188E-3,null,1.9242257506681341E-3,null,1.9116491117748783E-3,null,1.9525231881779596E-3,null,1.9446627888696747E-3,null,null,3.364250903945921E-4]
["MRC/RLS Les Laurentides",2200,4.2499556885991691E-2,11700,0.23122673651456366,11000,0.21751974319081474,12600,0.2486952754199736,11300,0.22199027118577308,48800,1900,3.8068416802883198E-2,50800,null,4.2499556885991691E-4,null,2.3122673651456366E-3,null,2.1751974319081475E-3,null,2.4869527541997363E-3,null,2.2199027118577309E-3,null,null,3.8068416802883201E-4]
["    Amherst",1000,0.60185185185185186,0,0,0,0,700,0.39814814814814814,0,0,1700,0,0,1700,null,6.0185185185185185E-3,null,0,null,0,null,3.9814814814814817E-3,null,0,null,null,0]
["    Arundel",0,0,0,0,0,0,0,0,600,1,600,0,0,600,null,0,null,0,null,0,null,0,null,0.01,null,null,0]
["    Barkmere",0,0,0,0,0,0,0,0,0,0,0,100,1,100,null,0,null,0,null,0,null,0,null,0,null,null,0.01]
["    Brébeuf",0,0,600,0.554013875123885,0,0,500,0.445986124876115,0,0,1100,0,0,1000,null,0,null,5.5401387512388498E-3,null,0,null,4.4598612487611496E-3,null,0,null,null,0]
["    Huberdeau",0,0,0,0,0,0,900,1,0,0,900,0,0,900,null,0,null,0,null,0,null,0.01,null,0,null,null,0]
["    Ivry-sur-le-Lac",0,0,400,1,0,0,0,0,0,0,400,0,0,400,null,0,null,0.01,null,0,null,0,null,0,null,null,0]
["    La Conception",0,0,600,0.37851997380484614,900,0.62148002619515386,0,0,0,0,1500,0,0,1500,null,0,null,3.7851997380484613E-3,null,6.2148002619515389E-3,null,0,null,0,null,null,0]
["    La Minerve",0,0,1400,1,0,0,0,0,0,0,1400,0,0,1400,null,0,null,0.01,null,0,null,0,null,0,null,null,0]
["    Labelle",0,0,800,0.27233273056057866,1500,0.54575045207956596,500,0.18191681735985538,0,0,2800,0,0,2800,null,0,null,2.7233273056057865E-3,null,5.4575045207956594E-3,null,1.8191681735985538E-3,null,0,null,null,0]
["    Lac-Supérieur",0,0,700,0.3356997971602434,1300,0.66430020283975655,0,0,0,0,2000,0,0,2000,null,0,null,3.3569979716024339E-3,null,6.6430020283975658E-3,null,0,null,0,null,null,0]
["    Lac-Tremblant-Nord",0,0,0,0,0,0,0,0,0,0,0,100,1,100,null,0,null,0,null,0,null,0,null,0,null,null,0.01]
["    Lantier",0,0,900,1,0,0,0,0,0,0,900,0,0,900,null,0,null,0.01,null,0,null,0,null,0,null,null,0]
["    Montcalm",0,0,0,0,600,1,0,0,0,0,600,0,0,600,null,0,null,0,null,0.01,null,0,null,0,null,null,0]
["    Mont-Tremblant",600,5.5585880640465796E-2,1700,0.15574963609898107,300,3.1204512372634642E-2,4200,0.37991266375545846,3000,0.27174308588064044,9800,1200,0.1058042212518195,11000,null,{"$f":"C726/100","v":5.55858806404658E-4},null,{"$f":"E726/100","v":1.5574963609898108E-3},null,{"$f":"G726/100","v":3.1204512372634644E-4},null,{"$f":"I726/100","v":3.7991266375545845E-3},null,{"$f":"K726/100","v":2.7174308588064043E-3},null,null,{"$f":"N726/100","v":1.058042212518195E-3}]
["    Sainte-Agathe-des-Monts",500,4.5223441263045221E-2,1800,0.16100258674516099,1700,0.15127999286415128,2700,0.2411916867362412,3900,0.34519668183034519,10600,600,5.6105610561056105E-2,11200,null,4.5223441263045219E-4,null,1.6100258674516098E-3,null,1.5127999286415129E-3,null,2.411916867362412E-3,null,3.4519668183034518E-3,null,null,5.6105610561056108E-4]
["    Sainte-Lucie-des-Laurentides",0,0,1400,1,0,0,0,0,0,0,1400,0,0,1400,null,0,null,0.01,null,0,null,0,null,0,null,null,0]
["    Mont-Blanc",0,0,1500,0.40317460317460319,1700,0.44761904761904764,0,0,600,0.1492063492063492,3800,0,0,3800,null,0,null,4.0317460317460321E-3,null,4.4761904761904765E-3,null,0,null,1.492063492063492E-3,null,null,0]
["    Val-David",0,0,0,0,1100,0.19773299748110829,1900,0.34202950701691248,2600,0.46023749550197912,5600,0,0,5600,null,0,null,0,null,1.9773299748110829E-3,null,3.4202950701691247E-3,null,4.6023749550197909E-3,null,null,0]
["    Val-des-Lacs",0,0,0,0,800,1,0,0,0,0,800,0,0,800,null,0,null,0,null,0.01,null,0,null,0,null,null,0]
["    Val-Morin",0,0,0,0,1100,0.34101825168107586,1300,0.43003522254242715,700,0.22894652577649699,3100,0,0,3100,null,0,null,0,null,3.4101825168107586E-3,null,4.3003522254242716E-3,null,2.28946525776497E-3,null,null,0]
["Région des Laurentides",122900,0.19320861499764189,122400,0.1924225750668134,121600,0.19116491117748782,124200,0.19525231881779595,123700,0.19446627888696746,614600.46399999992,21400,3.3642509039459208E-2,636100,null,1.9320861499764188E-3,null,1.9242257506681341E-3,null,1.9116491117748783E-3,null,1.9525231881779596E-3,null,1.9446627888696747E-3,null,null,3.364250903945921E-4]
["MRC/RLS Antoine-Labelle",9100,0.24842301574241676,9600,0.26419285831824912,9800,0.26781306565739676,3000,8.1646645823048647E-2,2400,6.6013932313093077E-2,33840,2600,7.1910482145795623E-2,36500,null,2.4842301574241675E-3,null,2.6419285831824914E-3,null,2.6781306565739679E-3,null,8.164664582304865E-4,null,6.6013932313093077E-4,null,null,7.1910482145795627E-4]
["    Chute-Saint-Philippe",600,0.55052935514918189,0,0,500,0.44947064485081811,0,0,0,0,1039,0,0,1000,null,5.5052935514918189E-3,null,0,null,4.4947064485081813E-3,null,0,null,0,null,null,0]
["    Ferme-Neuve",1500,0.55265095729013258,400,0.14101620029455081,400,0.14653902798232696,400,0.15979381443298968,0,0,2716,0,0,2700,null,5.526509572901326E-3,null,1.4101620029455082E-3,null,1.4653902798232696E-3,null,1.5979381443298967E-3,null,0,null,null,0]
["    Kiamika",0,0,800,1,0,0,0,0,0,0,790,0,0,800,null,0,null,0.01,null,0,null,0,null,0,null,null,0]
["    La Macaza",0,0,0,0,500,0.41590493601462525,0,0,0,0,455,600,0.58409506398537481,1100,null,0,null,0,null,4.1590493601462528E-3,null,0,null,0,null,null,5.8409506398537482E-3]
["    Lac-des-Écorces",500,0.18162911611785096,800,0.29081455805892548,1000,0.34107452339688044,500,0.18648180242634316,0,0,2885,0,0,2900,null,1.8162911611785096E-3,null,2.9081455805892546E-3,null,3.4107452339688041E-3,null,1.8648180242634316E-3,null,0,null,null,0]
["    Lac-du-Cerf",0,0,400,1,0,0,0,0,0,0,445,0,0,400,null,0,null,0.01,null,0,null,0,null,0,null,null,0]
["    Lac-Saguay",0,0,0,0,500,1,0,0,0,0,526,0,0,500,null,0,null,0,null,0.01,null,0,null,0,null,null,0]
["    Lac-Saint-Paul",500,1,0,0,0,0,0,0,0,0,525,0,0,500,null,0.01,null,0,null,0,null,0,null,0,null,null,0]
["    L'Ascension",0,0,900,1,0,0,0,0,0,0,899,0,0,900,null,0,null,0.01,null,0,null,0,null,0,null,null,0]
["    Mont-Laurier",2600,0.18124118476727782,2900,0.20465444287729195,3500,0.24576868829337095,1700,0.11798307475317349,1600,0.11086036671368124,12202,2000,0.13949224259520451,14200,null,1.8124118476727782E-3,null,2.0465444287729195E-3,null,2.4576868829337094E-3,null,1.1798307475317348E-3,null,1.1086036671368125E-3,null,null,1.3949224259520452E-3]
["    Mont-Saint-Michel",600,1,0,0,0,0,0,0,0,0,581,0,0,600,null,0.01,null,0,null,0,null,0,null,0,null,null,0]
["    Nominingue",400,0.1574279379157428,1100,0.4860310421286031,500,0.2093126385809313,300,0.14722838137472283,0,0,2255,0,0,2300,null,1.5742793791574282E-3,null,4.8603104212860309E-3,null,2.0931263858093132E-3,null,1.4722838137472282E-3,null,0,null,null,0]
["    Notre-Dame-de-Pontmain",800,1,0,0,0,0,0,0,0,0,790,0,0,800,null,0.01,null,0,null,0,null,0,null,0,null,null,0]
["    Notre-Dame-du-Laus",0,0,1700,1,0,0,0,0,0,0,1730,0,0,1700,null,0,null,0.01,null,0,null,0,null,0,null,null,0]
["    Rivière-Rouge",800,0.17814726840855108,500,0.11854890952278126,2400,0.52299719283092205,0,0,800,0.18030662923774565,4631,0,0,4600,null,1.7814726840855108E-3,null,1.1854890952278125E-3,null,5.2299719283092202E-3,null,0,null,1.8030662923774565E-3,null,null,0]
["    Saint-Aimé-du-Lac-des-îles",800,1,0,0,0,0,0,0,0,0,815,0,0,800,null,0.01,null,0,null,0,null,0,null,0,null,null,0]
["    Sainte-Anne-du-Lac",0,0,0,0,600,0.9910873440285205,0,0,0,0,556,0,8.9126559714795012E-3,600,null,0,null,0,null,9.9108734402852047E-3,null,0,null,0,null,null,8.9126559714795006E-5]
["   Territoires non organisés","ND","ND","ND","ND","ND","ND","ND","ND","ND","ND","ND","ND","ND","ND",null,{"$error":"#VALUE!"},null,{"$error":"#VALUE!"},null,{"$error":"#VALUE!"},null,{"$error":"#VALUE!"},null,{"$error":"#VALUE!"},null,null,{"$error":"#VALUE!"}]
[]
[]
[]
[]
[]
["RLS"]
[]
["Défavorisation combinée 2021 RLS"]
[]
["Répartition de la population (N, %) par profil de défavorisation combinée 2021\nRégion des Laurentides (variation régionale 2021)"]
[null,"Conditions\nplus favorables",null,null,null,null,null,null,null,"Conditions\nplus défavorables",null,"Population\navec indice","Population\nsans indice",null,"Population\ntotale"]
[null,"Profil 1",null,"Profil 2",null,"Profil 3",null,"Profil 4",null,"Profil 5"]
[null,"matériellement \nET socialement \nplus favorables",null,"moyennes matériellement\nEt socialement",null,"socialement\nplus défavorables\n(pas matériellement)",null,"matériellement\nplus défavorables\n(pas socialement)",null,"matériellement\nET socialement\nplus défavorables"]
[null,"N","%","N","%","N","%","N","%","N","%","N","N","%","N"]
["Région des Laurentides",101800,0.16003772991667978,123800,0.19462348687313316,142900,0.22465021223078133,141000,0.22166326049363308,105100,0.16522559346014778,614600,21400,3.3642509039459208E-2,636100]
["RLS de Deux-Montagnes - Mirabel-Sud",22100,0.18100000000000002,31900,0.26100000000000001,25900,0.21199999999999999,26100,0.214,13500,0.111,119400,2600,2.1000000000000001E-2,122100,null,{"$f":"C768/100","v":1.8100000000000002E-3},null,{"$f":"E768/100","v":2.6099999999999999E-3},null,{"$f":"G768/100","v":2.1199999999999999E-3},null,{"$f":"I768/100","v":2.14E-3},null,{"$f":"K768/100","v":1.1100000000000001E-3},null,null,{"$f":"N768/100","v":2.1000000000000001E-4}]
["    Deux-Montagnes",3000,0.16600000000000001,4300,0.24100000000000002,7100,0.39799999999999996,1500,8.3000000000000004E-2,1100,6.0999999999999999E-2,17000,900,5.2000000000000005E-2,17900,null,{"$f":"C769/100","v":1.66E-3},null,{"$f":"E769/100","v":2.4100000000000002E-3},null,{"$f":"G769/100","v":3.98E-3},null,{"$f":"I769/100","v":8.3000000000000001E-4},null,{"$f":"K769/100","v":6.0999999999999997E-4},null,null,{"$f":"N769/100","v":5.2000000000000006E-4}]
["    Mirabel",0,0,9000,0.45200000000000001,6400,0.32100000000000001,3700,0.187,800,0.04,20000,0,0,20000,null,0,null,4.5199999999999997E-3,null,3.2100000000000002E-3,null,1.8699999999999999E-3,null,4.0000000000000002E-4,null,null,0]
["    Oka",1800,0.45100000000000001,1100,0.27899999999999997,500,0.13699999999999998,500,0.13,0,0,4000,0,3.0000000000000001E-3,4000,null,4.5100000000000001E-3,null,2.7899999999999995E-3,null,1.3699999999999999E-3,null,1.2999999999999999E-3,null,0,null,null,3.0000000000000001E-5]
["    Pointe-Calumet",0,0,0,0,500,8.1000000000000003E-2,3300,0.52400000000000002,2500,0.39500000000000002,6300,0,0,6300,null,0,null,0,null,8.1000000000000006E-4,null,5.2399999999999999E-3,null,3.9500000000000004E-3,null,null,0]
["    Sainte-Marthe-sur-le-Lac",6500,0.32700000000000001,7100,0.35899999999999999,2300,0.11699999999999999,3000,0.151,900,4.5999999999999999E-2,19800,0,0,19800,null,3.2700000000000003E-3,null,3.5899999999999999E-3,null,1.17E-3,null,1.5100000000000001E-3,null,4.6000000000000001E-4,null,null,0]
["    Saint-Eustache",9300,0.20600000000000002,8800,0.19500000000000001,7400,0.16300000000000001,9800,0.217,8200,0.182,43600,1700,3.7000000000000005E-2,45300,null,2.0600000000000002E-3,null,1.9500000000000001E-3,null,1.6300000000000002E-3,null,2.1700000000000001E-3,null,1.82E-3,null,null,3.7000000000000005E-4]
["    Saint-Joseph-du-Lac",1500,0.214,700,0.10300000000000001,1600,0.221,3200,0.46100000000000002,0,0,7000,0,0,7000,null,2.14E-3,null,1.0300000000000001E-3,null,2.2100000000000002E-3,null,4.6100000000000004E-3,null,0,null,null,0]
["    Saint-Placide",0,0,700,0.41799999999999998,0,0,1000,0.58200000000000007,0,0,1800,0,0,1800,null,0,null,4.1799999999999997E-3,null,0,null,5.8200000000000005E-3,null,0,null,null,0]
["Région des Laurentides",101800,0.16003772991667978,123800,0.19462348687313316,142900,0.22465021223078133,141000,0.22166326049363308,105100,0.16522559346014778,614600,21400,3.3642509039459208E-2,636100]
["RLS de la Rivière-du-Nord - Mirabel-Nord",18600,0.10300000000000001,42200,0.23199999999999998,43600,0.24,38400,0.21199999999999999,35800,0.19699999999999998,178600,2900,1.6E-2,181500,null,{"$f":"C778/100","v":1.0300000000000001E-3},null,{"$f":"E778/100","v":2.32E-3},null,{"$f":"G778/100","v":2.3999999999999998E-3},null,{"$f":"I778/100","v":2.1199999999999999E-3},null,{"$f":"K778/100","v":1.97E-3},null,null,{"$f":"N778/100","v":1.6000000000000001E-4}]
["    Mirabel",5700,0.13900000000000001,15900,0.38799999999999996,9700,0.23699999999999999,3800,9.1999999999999998E-2,5900,0.14400000000000002,41100,0,0,41100,null,{"$f":"C779/100","v":1.3900000000000002E-3},null,{"$f":"E779/100","v":3.8799999999999998E-3},null,{"$f":"G779/100","v":2.3699999999999997E-3},null,{"$f":"I779/100","v":9.2000000000000003E-4},null,{"$f":"K779/100","v":1.4400000000000001E-3},null,null,{"$f":"N779/100","v":0}]
["    Prévost",4500,0.32899999999999996,1500,0.111,4300,0.318,2600,0.193,700,0.05,13700,0,0,13700,null,3.2899999999999995E-3,null,1.1100000000000001E-3,null,3.1800000000000001E-3,null,1.9300000000000001E-3,null,5.0000000000000001E-4,null,null,0]
["    Saint-Colomban",4900,0.27500000000000002,6700,0.376,0,0,6200,0.34899999999999998,0,0,17700,0,0,17700,null,2.7500000000000003E-3,null,3.7599999999999999E-3,null,0,null,3.4899999999999996E-3,null,0,null,null,0]
["    Sainte-Sophie",0,0,3200,0.17699999999999999,0,0,13600,0.75099999999999989,1300,7.2000000000000008E-2,18100,0,0,18100,null,0,null,1.7699999999999999E-3,null,0,null,7.5099999999999993E-3,null,7.2000000000000005E-4,null,null,0]
["    Saint-Hippolyte",1300,0.12300000000000001,3000,0.27699999999999997,1700,0.16300000000000001,3900,0.36299999999999999,800,7.400000000000001E-2,10700,0,0,10700,null,1.2300000000000002E-3,null,2.7699999999999999E-3,null,1.6300000000000002E-3,null,3.63E-3,null,7.400000000000001E-4,null,null,0]
["    Saint-Jérôme",2200,2.7999999999999997E-2,11900,0.14800000000000002,27800,0.34700000000000003,8300,0.10400000000000001,27100,0.33799999999999997,77400,2900,3.6000000000000004E-2,80200,null,2.7999999999999998E-4,null,1.4800000000000002E-3,null,3.4700000000000004E-3,null,1.0400000000000001E-3,null,3.3799999999999998E-3,null,null,3.6000000000000002E-4]
[]
["Défavorisation matérielle 2021 RLS"]
["Répartition de la population (N, %) par quintile de défavorisation matérielle 2021\nRégion des Laurentides (variation régionale 2021)"]
[null,"Conditions\nplus favorables",null,null,null,null,null,null,null,"Conditions\nplus défavorables",null,"Population avec indice","Population\nsans indice",null,"Population totale"]
[null,"Quintile 1",null,"Quintile 2",null,"Quintile 3",null,"Quintile 4",null,"Quintile 5"]
[null,"N","%","N","%","N","%",null,null,null,null,"N","N","%","N"]
["Région des Laurentides",117400,0.18456217575852854,128200,0.20154063826442384,123000,0.19336582298380758,122800,0.19305140701147619,123300,0.19383744694230468,614600,21400,3.3642509039459208E-2,636100]
["RLS de Deux-Montagnes—Mirabel-Sud",14200,0.11638599534569087,38900,0.31846420104840478,26700,0.21911346939753357,24600,0.20185043163227318,15000,0.12272761874573063,119400,2600,2.1458283830367086E-2,122100,null,{"$f":"C792/100","v":1.1638599534569086E-3},null,{"$f":"E792/100","v":3.1846420104840478E-3},null,{"$f":"G792/100","v":2.1911346939753355E-3},null,{"$f":"I792/100","v":2.0185043163227319E-3},null,{"$f":"K792/100","v":1.2272761874573062E-3},null,null,{"$f":"N792/100","v":2.1458283830367086E-4}]
["    Deux-Montagnes",4100,0.23097962601172203,4200,0.23298911526653643,6100,0.33999441808540332,2100,0.11521071727602568,500,2.9249232486742952E-2,17000,900,5.1576890873569627E-2,17900,null,{"$f":"C793/100","v":2.3097962601172205E-3},null,{"$f":"E793/100","v":2.3298911526653645E-3},null,{"$f":"G793/100","v":3.3999441808540334E-3},null,{"$f":"I793/100","v":1.1521071727602567E-3},null,{"$f":"K793/100","v":2.924923248674295E-4},null,null,{"$f":"N793/100","v":5.1576890873569628E-4}]
["    Mirabel",0,0,10300,0.51322164011411298,5200,0.26036440146535034,2600,0.13080806431716516,1900,9.5605894103371475E-2,20000,0,0,20000,null,0,null,5.1322164011411301E-3,null,2.6036440146535032E-3,null,1.3080806431716517E-3,null,9.5605894103371479E-4,null,null,0]
["    Oka",600,0.15045362903225806,1200,0.30090725806451613,1700,0.41658266129032256,0,0,500,0.12953629032258066,4000,0,2.5201612903225806E-3,4000,null,1.5045362903225805E-3,null,3.0090725806451611E-3,null,4.1658266129032256E-3,null,0,null,1.2953629032258066E-3,null,null,2.5201612903225806E-5]
["    Pointe-Calumet",0,0,0,0,500,8.0560420315236414E-2,3900,0.61869129119566946,1900,0.30074828848909407,6300,0,0,6300,null,0,null,0,null,8.0560420315236409E-4,null,6.1869129119566943E-3,null,3.0074828848909406E-3,null,null,0]
["    Sainte-Marthe-sur-le-Lac",700,3.4550689498408851E-2,11300,0.5719553467697126,3900,0.19689851997777441,3500,0.17689548921553772,400,1.9699954538566451E-2,19800,0,0,19800,null,3.455068949840885E-4,null,5.7195534676971263E-3,null,1.9689851997777442E-3,null,1.7689548921553772E-3,null,1.969995453856645E-4,null,null,0]
["    Saint-Eustache",8200,0.18208322289954942,8600,0.19096209912536444,8700,0.19133757399063522,9400,0.20869776482021379,8600,0.18970315398886828,43600,1700,3.721618517536885E-2,45300,null,1.8208322289954943E-3,null,1.9096209912536444E-3,null,1.9133757399063523E-3,null,2.0869776482021381E-3,null,1.8970315398886828E-3,null,null,3.721618517536885E-4]
["    Saint-Joseph-du-Lac",500,7.7087185322144786E-2,2500,0.35883942540179203,700,0.10311477741430806,2600,0.36495519840705448,700,9.6003413454700592E-2,7000,0,0,7000,null,7.7087185322144783E-4,null,3.5883942540179204E-3,null,1.0311477741430806E-3,null,3.6495519840705447E-3,null,9.6003413454700593E-4,null,null,0]
["    Saint-Placide",0,0,700,0.4176008968609865,0,0,600,0.3099775784753363,500,0.27242152466367714,1800,0,0,1800,null,0,null,4.1760089686098652E-3,null,0,null,3.0997757847533629E-3,null,2.7242152466367712E-3,null,null,0]
["Région des Laurentides",117400,0.18456217575852854,128200,0.20154063826442384,123000,0.19336582298380758,122800,0.19305140701147619,123300,0.19383744694230468,614600,21400,3.3642509039459208E-2,636100]
["RLS de la Rivière-du-Nord—Mirabel-Nord",16900,9.3059377530005344E-2,39200,0.21600031897257249,48400,0.26640200177877782,42000,0.23125180939224702,32200,0.17753510043969523,178600,2900,1.5751391886702104E-2,181500,null,9.3059377530005339E-4,null,2.1600031897257249E-3,null,2.6640200177877782E-3,null,2.31251809392247E-3,null,1.7753510043969523E-3,null,null,1.5751391886702104E-4]
["    Mirabel",7000,0.17071590705669454,15200,0.36992176429076168,9200,0.22289476916292744,6400,0.15578008959690393,3300,8.068746989271243E-2,41100,0,0,41100,null,1.7071590705669453E-3,null,3.6992176429076168E-3,null,2.2289476916292745E-3,null,1.5578008959690392E-3,null,8.0687469892712425E-4,null,null,0]
["    Prévost",3300,0.24174700555068654,4600,0.33939526730937769,2400,0.17586912065439672,3300,0.24298860648553899,0,0,13700,0,0,13700,null,2.4174700555068653E-3,null,3.3939526730937769E-3,null,1.7586912065439672E-3,null,2.4298860648553897E-3,null,0,null,null,0]
["    Saint-Colomban",400,2.423281172300025E-2,4500,0.25103705163099221,6700,0.3760594247153039,5400,0.30482622932490316,800,4.3844482605800456E-2,17700,0,0,17700,null,2.4232811723000249E-4,null,2.5103705163099219E-3,null,3.7605942471530388E-3,null,3.0482622932490318E-3,null,4.3844482605800457E-4,null,null,0]
["    Sainte-Sophie",0,0,0,0,3200,0.17704646017699116,8800,0.48761061946902656,6100,0.33534292035398233,18100,0,0,18100,null,0,null,0,null,1.7704646017699117E-3,null,4.8761061946902655E-3,null,3.3534292035398232E-3,null,null,0]
["    Saint-Hippolyte",2000,0.18361608398162901,2200,0.20254944230949479,1900,0.17733620770456462,4700,0.43649826600431152,0,0,10700,0,0,10700,null,1.8361608398162902E-3,null,2.025494423094948E-3,null,1.7733620770456462E-3,null,4.3649826600431155E-3,null,0,null,null,0]
["    Saint-Jérôme",4200,5.2036452944036506E-2,12700,0.15877725555707928,25000,0.3118821138718163,13400,0.16656901001084612,22100,0.27509256604291077,77400,2900,3.5642601573311061E-2,80200,null,5.2036452944036508E-4,null,1.5877725555707928E-3,null,3.1188211387181632E-3,null,1.6656901001084613E-3,null,2.7509256604291077E-3,null,null,3.5642601573311063E-4]
[null,null,null,null,null,null,null,null,null,null,null,null,null,null,null,null,0,null,0,null,0,null,0,null,0,null,null,0]
["Défavorisation sociale 2021 RLS"]
["Répartition de la population (N, %) par quintile de défavorisation sociale 2021\nRégion des Laurentides (variation régionale 2021)"]
[null,"Conditions\nplus favorables",null,null,null,null,null,null,null,"Conditions\nplus défavorables",null,"Population avec indice","Population\nsans indice",null,"Population totale"]
[null,"Quintile 1",null,"Quintile 2",null,"Quintile 3",null,"Quintile 4",null,"Quintile 5"]
[null,"N","%","N","%","N","%",null,null,null,null,"N","N","%","N"]
["Région des Laurentides",137500,0.21616098097783368,127500,0.20044018236126396,121600,0.19116491117748782,125300,0.19698160666561862,102900,0.16176701776450245,614600.46399999992,21400,3.3642509039459208E-2,636100]
["RLS de Deux-Montagnes - Mirabel-Sud",25800,0.21121538711837839,30700,0.25159454344109122,23600,0.19311636116141739,21200,0.17386584715194786,18200,0.14874957729679816,119400,2600,2.1458283830367086E-2,122100,null,{"$f":"C816/100","v":2.1121538711837838E-3},null,{"$f":"E816/100","v":2.5159454344109121E-3},null,{"$f":"G816/100","v":1.9311636116141739E-3},null,{"$f":"I816/100","v":1.7386584715194785E-3},null,{"$f":"K816/100","v":1.4874957729679816E-3},null,null,{"$f":"N816/100","v":2.1458283830367086E-4}]
["    Deux-Montagnes",2800,0.15662852358358917,3400,0.18816634105498189,2600,0.14496232207647222,2800,0.1574099916271281,5400,0.301255930784259,17000,900,5.1576890873569627E-2,17900,null,{"$f":"C817/100","v":1.5662852358358918E-3},null,{"$f":"E817/100","v":1.881663410549819E-3},null,{"$f":"G817/100","v":1.4496232207647222E-3},null,{"$f":"I817/100","v":1.5740999162712809E-3},null,{"$f":"K817/100","v":3.0125593078425901E-3},null,null,{"$f":"N817/100","v":5.1576890873569628E-4}]
["    Mirabel",3400,0.17211061061914468,3300,0.16497552074085367,6000,0.30201861944788899,6400,0.32109279537083457,800,3.9802453821278082E-2,20000,0,0,20000,null,1.7211061061914467E-3,null,1.6497552074085367E-3,null,3.0201861944788898E-3,null,3.2109279537083455E-3,null,3.9802453821278084E-4,null,null,0]
["    Oka",600,0.15650201612903225,2800,0.7036290322580645,0,0,500,0.13734879032258066,0,0,4000,0,2.5201612903225806E-3,4000,null,1.5650201612903225E-3,null,7.0362903225806451E-3,null,0,null,1.3734879032258065E-3,null,0,null,null,2.5201612903225806E-5]
["    Pointe-Calumet",500,8.6451202037892069E-2,2800,0.43798758159528739,0,0,1600,0.25680624104441968,1400,0.2187549753224009,6300,0,0,6300,null,8.6451202037892067E-4,null,4.3798758159528739E-3,null,0,null,2.5680624104441967E-3,null,2.1875497532240092E-3,null,null,0]
["    Sainte-Marthe-sur-le-Lac",1200,6.2332676668182048E-2,7200,0.36409557003586401,8100,0.41046623225741269,3200,0.1631055210385412,0,0,19800,0,0,19800,null,6.2332676668182046E-4,null,3.64095570035864E-3,null,4.1046623225741265E-3,null,1.631055210385412E-3,null,0,null,null,0]
["    Saint-Eustache",13900,0.30795564979238449,8700,0.19188974291015107,5300,0.11787702093824542,5000,0.11120682039049386,10600,0.2338545807933563,43600,1700,3.721618517536885E-2,45300,null,3.0795564979238447E-3,null,1.9188974291015108E-3,null,1.1787702093824543E-3,null,1.1120682039049386E-3,null,2.338545807933563E-3,null,null,3.721618517536885E-4]
["    Saint-Joseph-du-Lac",3200,0.45370502062295548,1600,0.22173232826056041,700,0.10311477741430806,1600,0.22144787370217606,0,0,7000,0,0,7000,null,4.5370502062295551E-3,null,2.2173232826056041E-3,null,1.0311477741430806E-3,null,2.2144787370217607E-3,null,0,null,null,0]
["    Saint-Placide",0,0,1000,0.58239910313901344,700,0.4176008968609865,0,0,0,0,1800,0,0,1800,null,0,null,5.8239910313901341E-3,null,4.1760089686098652E-3,null,0,null,0,null,null,0]
["Région des Laurentides",137500,0.21616098097783368,127500,0.20044018236126396,121600,0.19116491117748782,125300,0.19698160666561862,102900,0.16176701776450245,614600.46399999992,21400,3.3642509039459208E-2,636100]
["RLS de la Rivière-du-Nord - Mirabel-Nord",30700,0.16940872652123226,31300,0.17250627437330246,37200,0.20475156630898814,39300,0.21637938814619007,40200,0.22120265276358497,178600,2900,1.5751391886702104E-2,181500,null,{"$f":"C826/100","v":1.6940872652123225E-3},null,{"$f":"E826/100","v":1.7250627437330247E-3},null,{"$f":"G826/100","v":2.0475156630898814E-3},null,{"$f":"I826/100","v":2.1637938814619007E-3},null,{"$f":"K826/100","v":2.2120265276358497E-3},null,null,{"$f":"N826/100","v":1.5751391886702104E-4}]
["    Mirabel",2400,5.9402713740730702E-2,7100,0.17199768723488465,15900,0.38743121283727183,11000,0.26681451342086582,4700,0.11435387276624694,41100,0,0,41100,null,{"$f":"C827/100","v":5.9402713740730701E-4},null,{"$f":"E827/100","v":1.7199768723488466E-3},null,{"$f":"G827/100","v":3.8743121283727183E-3},null,{"$f":"I827/100","v":2.6681451342086583E-3},null,{"$f":"K827/100","v":1.1435387276624693E-3},null,null,{"$f":"N827/100","v":0}]
["    Prévost",5600,0.41221151037101955,3000,0.22056675430908559,0,0,2700,0.19872918492550398,2300,0.16849255039439087,13700,0,0,13700,null,4.1221151037101958E-3,null,2.2056675430908558E-3,null,0,null,1.98729184925504E-3,null,1.6849255039439086E-3,null,null,0]
["    Saint-Colomban",10800,0.60790544199070629,4600,0.2566162338648923,2400,0.13547832414440142,0,0,0,0,17700,0,0,17700,null,6.0790544199070626E-3,null,2.566162338648923E-3,null,1.3547832414440141E-3,null,0,null,0,null,null,0]
["    Sainte-Sophie",3200,0.17505530973451328,4800,0.26332964601769909,8900,0.48949115044247793,1300,7.212389380530973E-2,0,0,18100,0,0,18100,null,1.7505530973451328E-3,null,2.6332964601769909E-3,null,4.8949115044247789E-3,null,7.2123893805309735E-4,null,0,null,null,0]
["    Saint-Hippolyte",1300,0.12287937013778234,3000,0.28400037491798669,3800,0.35589089886587311,2500,0.23722935607835788,0,0,10700,0,0,10700,null,1.2287937013778234E-3,null,2.8400037491798668E-3,null,3.5589089886587312E-3,null,2.3722935607835786E-3,null,0,null,null,0]
["    Saint-Jérôme",7400,9.2254372732599454E-2,8900,0.11065538005061523,6200,7.7119668881602738E-2,21800,0.27115305499108622,33100,0.4131749217707853,77400,2900,3.5642601573311061E-2,80200,null,9.2254372732599452E-4,null,1.1065538005061524E-3,null,7.7119668881602736E-4,null,2.7115305499108623E-3,null,4.1317492177078531E-3,null,null,3.5642601573311063E-4]
[]
[]
[]
["DONNÉES régionale PAR RLS ET MRC"]
[]
[]
[]
["Défavorisation combinée 2021 RLS"]
[]
["Répartition de la population (N, %) par profil de défavorisation combinée 2021\nRégion des Laurentides (variation régionale 2021)"]
[null,"Conditions\nplus favorables",null,null,null,null,null,null,null,"Conditions\nplus défavorables",null,"Population\navec indice","Population\nsans indice",null,"Population\ntotale"]
[null,"Profil 1",null,"Profil 2",null,"Profil 3",null,"Profil 4",null,"Profil 5"]
[null,"matériellement \nET socialement \nplus favorables",null,"moyennes matériellement\nEt socialement",null,"socialement\nplus défavorables\n(pas matériellement)",null,"matériellement\nplus défavorables\n(pas socialement)",null,"matériellement\nET socialement\nplus défavorables"]
[null,"N","%","N","%","N","%","N","%","N","%","N","N","%","N"]
["Région des Laurentides",101800,0.16003772991667978,123800,0.19462348687313316,142900,0.22465021223078133,141000,0.22166326049363308,105100,0.16522559346014778,614600,21400,3.3642509039459208E-2,636100]
["RLS d'Antoine-Labelle",700,1.8622127146069881E-2,2000,5.6140639569963249E-2,500,1.3054687071471669E-2,25700,0.7056661730020295,4900,0.13460589106467008,33800,2600,7.1910482145795623E-2,36500,"x",{"$f":"C848/100","v":1.8622127146069881E-4},null,{"$f":"E848/100","v":5.6140639569963254E-4},null,{"$f":"G848/100","v":1.3054687071471668E-4},null,{"$f":"I848/100","v":7.0566617300202947E-3},null,{"$f":"K848/100","v":1.3460589106467009E-3},null,null,{"$f":"N848/100","v":7.1910482145795627E-4}]
["RLS des Laurentides",2800,5.4394706264647381E-2,8800,0.17309017862418025,9100,0.17953010221163124,13400,0.2637611517025425,14800,0.29115544439411545,48800,1900,3.8068416802883198E-2,50800,"x",{"$f":"C849/100","v":5.4394706264647387E-4},null,{"$f":"E849/100","v":1.7309017862418025E-3},null,{"$f":"G849/100","v":1.7953010221163123E-3},null,{"$f":"I849/100","v":2.6376115170254249E-3},null,{"$f":"K849/100","v":2.9115544439411545E-3},null,null,{"$f":"N849/100","v":3.8068416802883201E-4}]
["RLS des Pays-d'en-Haut",4600,9.8217712019784256E-2,12700,0.27132989383021361,21800,0.46392785571142281,3900,8.3912505862789408E-2,3900,8.2398840233658802E-2,46900,0,2.1319234213107061E-4,46900,"x",9.8217712019784266E-4,null,2.7132989383021359E-3,null,4.6392785571142282E-3,null,8.3912505862789412E-4,null,8.2398840233658798E-4,null,null,2.1319234213107061E-6]
["RLS d'Argenteuil",1100,3.2504933309665418E-2,4800,0.13800000000000001,700,1.9E-2,12000,0.34600000000000003,14700,0.42200000000000004,33300,1500,4.2999999999999997E-2,34700,"x",3.2504933309665421E-4,null,1.3800000000000002E-3,null,1.8999999999999998E-4,null,3.4600000000000004E-3,null,4.2200000000000007E-3,null,null,4.2999999999999999E-4]
["RLS de Deux-Montagnes—Mirabel-Sud",22100,0.18100000000000002,31900,0.26100000000000001,25900,0.21199999999999999,26100,0.214,13500,0.111,119400,2600,2.1000000000000001E-2,122100,"x",1.8100000000000002E-3,null,2.6099999999999999E-3,null,2.1199999999999999E-3,null,2.14E-3,null,1.1100000000000001E-3,null,null,2.1000000000000001E-4]
["RLS de la Rivière-du-Nord—Mirabel-Nord",18600,0.10300000000000001,42200,0.23199999999999998,43600,0.24,38400,0.21199999999999999,35800,0.19699999999999998,178600,2900,1.6E-2,181500,"x",1.0300000000000001E-3,null,2.32E-3,null,2.3999999999999998E-3,null,2.1199999999999999E-3,null,1.97E-3,null,null,1.6000000000000001E-4]
["RLS de Thérèse-De Blainville",51900,0.31697956389948179,21500,0.13156350836022293,41300,0.25229783905348585,21500,0.13164906619732081,17500,0.10717341351324924,153800,9900,6.033660897623936E-2,163600,"x",3.169795638994818E-3,null,1.3156350836022292E-3,null,2.5229783905348583E-3,null,1.316490661973208E-3,null,1.0717341351324924E-3,null,null,6.0336608976239363E-4]
[]
["Défavorisation matérielle 2021 RLS"]
["Répartition de la population (N, %) par quintile de défavorisation matérielle 2021\nRégion des Laurentides (variation régionale 2021)"]
[null,"Conditions\nplus favorables",null,null,null,null,null,null,null,"Conditions\nplus défavorables",null,"Population avec indice","Population\nsans indice",null,"Population totale"]
[null,"Quintile 1",null,"Quintile 2",null,"Quintile 3",null,"Quintile 4",null,"Quintile 5"]
[null,"N","%","N","%","N","%",null,null,null,null,"N","N","%","N"]
["Région des Laurentides",117400,0.18456217575852854,128200,0.20154063826442384,123000,0.19336582298380758,122800,0.19305140701147619,123300,0.19383744694230468,614600,21400,3.3642509039459208E-2,636100]
["RLS d'Antoine-Labelle",0,0,700,1.8622127146069881E-2,2500,6.9195326641434921E-2,6200,0.16869617684164337,24500,0.67157588722505623,33800,2600,7.1910482145795623E-2,36500,null,{"$f":"C862/100","v":0},null,{"$f":"E862/100","v":1.8622127146069881E-4},null,{"$f":"G862/100","v":6.9195326641434917E-4},null,{"$f":"I862/100","v":1.6869617684164336E-3},null,{"$f":"K862/100","v":6.7157588722505622E-3},null,null,{"$f":"N862/100","v":7.1910482145795627E-4}]
["RLS des Laurentides",2800,5.573389526754239E-2,5300,0.10392500541583788,12600,0.2473560864170786,14100,0.27847253677846268,14000,0.27644405931819527,48800,1900,3.8068416802883198E-2,50800,null,5.573389526754239E-4,null,1.0392500541583788E-3,null,2.4735608641707858E-3,null,2.7847253677846266E-3,null,2.7644405931819527E-3,null,null,3.8068416802883201E-4]
["RLS des Pays-d'en-Haut",15600,0.33187651899543769,14100,0.30153924871018634,9400,0.20005969385579669,4500,9.6064469364260441E-2,3300,7.0246876732187782E-2,46900,0,2.1319234213107061E-4,46900,null,3.3187651899543769E-3,null,3.0153924871018632E-3,null,2.0005969385579669E-3,null,9.6064469364260437E-4,null,7.0246876732187784E-4,null,null,2.1319234213107061E-6]
["RLS d'Argenteuil",0,0,3200,9.2825882199633336E-2,3400,9.7330844058144794E-2,6500,0.18841662804514306,20100,0.57874727203113296,33300,1500,0,34700,null,0,null,9.2825882199633336E-4,null,9.7330844058144794E-4,null,1.8841662804514306E-3,null,5.7874727203113298E-3,null,null,0]
["RLS de Deux-Montagnes—Mirabel-Sud",14200,0.11638599534569087,38900,0.31846420104840478,26700,0.21911346939753357,24600,0.20185043163227318,15000,0.12272761874573063,119400,2600,2.1458283830367086E-2,122100,null,1.1638599534569086E-3,null,3.1846420104840478E-3,null,2.1911346939753355E-3,null,2.0185043163227319E-3,null,1.2272761874573062E-3,null,null,2.1458283830367086E-4]
["RLS de la Rivière-du-Nord—Mirabel-Nord",16900,9.3059377530005344E-2,39200,0.21600031897257249,48400,0.26640200177877782,42000,0.23125180939224702,32200,0.17753510043969523,178600,2900,1.5751391886702104E-2,181500,null,9.3059377530005339E-4,null,2.1600031897257249E-3,null,2.6640200177877782E-3,null,2.31251809392247E-3,null,1.7753510043969523E-3,null,null,1.5751391886702104E-4]
["RLS de Thérèse-De Blainville",67900,0.41518162706561063,26800,0.16372714383494671,20000,0.12193214041263323,24900,0.15209127798963529,14200,8.6731201720934778E-2,153800,9900,6.033660897623936E-2,163600,null,4.151816270656106E-3,null,1.6372714383494672E-3,null,1.2193214041263322E-3,null,1.5209127798963529E-3,null,8.6731201720934774E-4,null,null,6.0336608976239363E-4]
[]
["Défavorisation sociale 2021 RLS"]
["Répartition de la population (N, %) par quintile de défavorisation matérielle 2021\nRégion des Laurentides (variation régionale 2021)"]
[null,"Conditions\nplus favorables",null,null,null,null,null,null,null,"Conditions\nplus défavorables",null,"Population avec indice","Population\nsans indice",null,"Population totale"]
[null,"Quintile 1",null,"Quintile 2",null,"Quintile 3",null,"Quintile 4",null,"Quintile 5"]
[null,"N","%","N","%","N","%",null,null,null,null,"N","N","%","N"]
["Région des Laurentides",137500,0.21616098097783368,127500,0.20044018236126396,121600,0.19116491117748782,125300,0.19698160666561862,102900,0.16176701776450245,614600.46399999992,21400,3.3642509039459208E-2,636100]
["RLS d'Antoine-Labelle",9100,0.24842301574241676,9600,0.26419285831824912,9800,0.26781306565739676,3000,8.1646645823048647E-2,2400,6.6013932313093077E-2,33800,2600,7.1910482145795623E-2,36500,null,{"$f":"C876/100","v":2.4842301574241675E-3},null,{"$f":"E876/100","v":2.6419285831824914E-3},null,{"$f":"G876/100","v":2.6781306565739679E-3},null,{"$f":"I876/100","v":8.164664582304865E-4},null,{"$f":"K876/100","v":6.6013932313093077E-4},null,null,{"$f":"N876/100","v":7.1910482145795627E-4}]
["RLS des Laurentides",2200,4.2499556885991691E-2,11700,0.23122673651456366,11000,0.21751974319081474,12600,0.2486952754199736,11300,0.22199027118577308,48800,1900,3.8068416802883198E-2,50800,null,4.2499556885991691E-4,null,2.3122673651456366E-3,null,2.1751974319081475E-3,null,2.4869527541997363E-3,null,2.2199027118577309E-3,null,null,3.8068416802883201E-4]
["RLS des Pays-d'en-Haut",200,3.7308659872937362E-3,8600,0.18276979490896686,12500,0.26695945081652667,16400,0.35001918731079179,9200,0.19630750863428986,46900,0,2.1319234213107061E-4,46900,null,3.7308659872937361E-5,null,1.8276979490896685E-3,null,2.6695945081652668E-3,null,3.5001918731079177E-3,null,1.9630750863428984E-3,null,null,2.1319234213107061E-6]
["RLS d'Argenteuil",1600,4.5154374431469302E-2,8800,0.25208930355320319,7600,0.2191526840635046,7900,0.22614600018004188,7500,0.21477826410583517,33300,1500,4.2679373665945805E-2,34700,null,4.5154374431469299E-4,null,2.5208930355320319E-3,null,2.191526840635046E-3,null,2.261460001800419E-3,null,2.1477826410583518E-3,null,null,4.2679373665945806E-4]
["RLS de Deux-Montagnes—Mirabel-Sud",25800,0.21121538711837839,30700,0.25159454344109122,23600,0.19311636116141739,21200,0.17386584715194786,18200,0.14874957729679816,119400,2600,2.1458283830367086E-2,122100,null,2.1121538711837838E-3,null,2.5159454344109121E-3,null,1.9311636116141739E-3,null,1.7386584715194785E-3,null,1.4874957729679816E-3,null,null,2.1458283830367086E-4]
["RLS de la Rivière-du-Nord—Mirabel-Nord",30700,0.16940872652123226,31300,0.17250627437330246,37200,0.20475156630898814,39300,0.21637938814619007,40200,0.22120265276358497,178600,2900,1.5751391886702104E-2,181500,null,1.6940872652123225E-3,null,1.7250627437330247E-3,null,2.0475156630898814E-3,null,2.1637938814619007E-3,null,2.2120265276358497E-3,null,null,1.5751391886702104E-4]
["RLS de Thérèse-De Blainville",53300,0.32557201525374002,21700,0.13256575730908379,20000,0.12205436589420163,23800,0.14566221765913759,35000,0.21380903490759753,153800,9900,6.033660897623936E-2,163600,null,3.2557201525374004E-3,null,1.3256575730908379E-3,null,1.2205436589420163E-3,null,1.4566221765913759E-3,null,2.1380903490759752E-3,null,null,6.0336608976239363E-4]
[]
[]
[]
["Défavorisation combinée 2021 MRC"]
[]
["Répartition de la population (N, %) par profil de défavorisation combinée 2021\nRégion des Laurentides (variation régionale 2021)"]
[null,"Conditions\nplus favorables",null,null,null,null,null,null,null,"Conditions\nplus défavorables",null,"Population\navec indice","Population\nsans indice",null,"Population\ntotale"]
[null,"Profil 1",null,"Profil 2",null,"Profil 3",null,"Profil 4",null,"Profil 5"]
[null,"matériellement \nET socialement \nplus favorables",null,"moyennes matériellement\nEt socialement",null,"socialement\nplus défavorables\n(pas matériellement)",null,"matériellement\nplus défavorables\n(pas socialement)",null,"matériellement\nET socialement\nplus défavorables"]
[null,"N","%","N","%","N","%","N","%","N","%","N","N","%","N"]
["Région des Laurentides",101800,0.16003772991667978,123800,0.19462348687313316,142900,0.22465021223078133,141000,0.22166326049363308,105100,0.16522559346014778,614600,21400,3.3642509039459208E-2,636100]
["MRC Deux-Montagnes",22100,0.2163700858385921,22800,0.22368988358875869,19400,0.1904617253948967,22400,0.21916277975933837,12700,0.12465213812566142,99400,2600,2.5663387292752714E-2,102100,null,{"$f":"C894/100","v":2.1637008583859211E-3},null,{"$f":"E894/100","v":2.2368988358875868E-3},null,{"$f":"G894/100","v":1.904617253948967E-3},null,{"$f":"I894/100","v":2.1916277975933835E-3},null,{"$f":"K894/100","v":1.2465213812566142E-3},null,null,{"$f":"N894/100","v":2.5663387292752712E-4}]
["MRC Thérèse-De Blainville",51900,0.31697956389948179,21500,0.13156350836022293,41300,0.25229783905348585,21500,0.13164906619732081,17500,0.10717341351324924,153800,9900,6.033660897623936E-2,163600,null,3.169795638994818E-3,null,1.3156350836022292E-3,null,2.5229783905348583E-3,null,1.316490661973208E-3,null,1.0717341351324924E-3,null,null,6.0336608976239363E-4]
["Mirabel",5700,9.3392027230477181E-2,25000,0.40899999999999997,16200,0.26400000000000001,7500,0.12300000000000001,6700,0.11,61100,0,0,61100,null,9.3392027230477181E-4,null,4.0899999999999999E-3,null,2.64E-3,null,1.2300000000000002E-3,null,1.1000000000000001E-3,null,null,0]
["MRC la Rivière-du-Nord",12900,9.2141530592598192E-2,26200,0.1867896970093762,33900,0.2414626317755906,34600,0.24660513554072958,29900,0.21263754488152217,137500,2900,2.0363460200183287E-2,140400,null,9.2141530592598189E-4,null,1.867896970093762E-3,null,2.4146263177559062E-3,null,2.466051355407296E-3,null,2.1263754488152218E-3,null,null,2.0363460200183286E-4]
["MRC Argenteuil",1100,3.2504933309665418E-2,4800,0.13800000000000001,700,1.9E-2,12000,0.34600000000000003,14700,0.42200000000000004,33300,1500,4.2999999999999997E-2,34700,null,3.2504933309665421E-4,null,1.3800000000000002E-3,null,1.8999999999999998E-4,null,3.4600000000000004E-3,null,4.2200000000000007E-3,null,null,4.2999999999999999E-4]
["MRC Les Pays-d'en-Haut",4600,9.8217712019784256E-2,12700,0.27132989383021361,21800,0.46392785571142281,3900,8.3912505862789408E-2,3900,8.2398840233658802E-2,46900,0,2.1319234213107061E-4,46900,null,9.8217712019784266E-4,null,2.7132989383021359E-3,null,4.6392785571142282E-3,null,8.3912505862789412E-4,null,8.2398840233658798E-4,null,null,2.1319234213107061E-6]
["MRC Les Laurentides",2800,5.4394706264647381E-2,8800,0.17309017862418025,9100,0.17953010221163124,13400,0.2637611517025425,14800,0.29115544439411545,48800,1900,3.8068416802883198E-2,50800,null,5.4394706264647387E-4,null,1.7309017862418025E-3,null,1.7953010221163123E-3,null,2.6376115170254249E-3,null,2.9115544439411545E-3,null,null,3.8068416802883201E-4]
["MRC Antoine-Labelle",700,1.8622127146069881E-2,2000,5.6140639569963249E-2,500,1.3054687071471669E-2,25700,0.7056661730020295,4900,0.13460589106467008,33800,2600,7.1910482145795623E-2,36500,null,{"$f":"C901/100","v":1.8622127146069881E-4},null,{"$f":"E901/100","v":5.6140639569963254E-4},null,{"$f":"G901/100","v":1.3054687071471668E-4},null,{"$f":"I901/100","v":7.0566617300202947E-3},null,{"$f":"K901/100","v":1.3460589106467009E-3},null,null,{"$f":"N901/100","v":7.1910482145795627E-4}]
[]
["Défavorisation matérielle 2021 MRC"]
["Répartition de la population (N, %) par quintile de défavorisation matérielle 2021\nRégion des Laurentides (variation régionale 2021)"]
[null,"Conditions\nplus favorables",null,null,null,null,null,null,null,"Conditions\nplus défavorables",null,"Population avec indice","Population\nsans indice",null,"Population totale"]
[null,"Quintile 1",null,"Quintile 2",null,"Quintile 3",null,"Quintile 4",null,"Quintile 5"]
[null,"N","%","N","%","N","%",null,null,null,null,"N","N","%","N"]
["Région des Laurentides",117400,0.18456217575852854,128200,0.20154063826442384,123000,0.19336582298380758,122800,0.19305140701147619,123300,0.19383744694230468,614600,21400,3.3642509039459208E-2,636100]
["MRC Deux-Montagnes",14200,0.13900000000000001,28600,0.28000000000000003,21500,0.21100000000000002,22000,0.21600000000000003,13100,0.128,99400,2600,2.6000000000000002E-2,102100,null,{"$f":"C909/100","v":1.3900000000000002E-3},null,{"$f":"E909/100","v":2.8000000000000004E-3},null,{"$f":"G909/100","v":2.1100000000000003E-3},null,{"$f":"I909/100","v":2.1600000000000005E-3},null,{"$f":"K909/100","v":1.2800000000000001E-3},null,null,{"$f":"N909/100","v":2.6000000000000003E-4}]
["MRC Thérèse-De Blainville",67900,0.41518162706561063,26800,0.16372714383494671,20000,0.12193214041263323,24900,0.15209127798963529,14200,8.6731201720934778E-2,153800,9900,6.033660897623936E-2,163600,null,4.151816270656106E-3,null,1.6372714383494672E-3,null,1.2193214041263322E-3,null,1.5209127798963529E-3,null,8.6731201720934774E-4,null,null,6.0336608976239363E-4]
["Mirabel",7000,0.115,25500,0.41700000000000004,14400,0.23499999999999999,9000,0.14800000000000002,5200,8.5999999999999993E-2,61100,0,0,61100,null,1.15E-3,null,4.1700000000000001E-3,null,2.3499999999999997E-3,null,1.4800000000000002E-3,null,8.5999999999999998E-4,null,null,0]
["MRC la Rivière-du-Nord",9900,7.2999999999999995E-2,24000,0.17100000000000001,39200,0.27899999999999997,35600,0.253,28900,0.20600000000000002,137500,2900,0.02,140400,null,7.2999999999999996E-4,null,1.7100000000000001E-3,null,2.7899999999999995E-3,null,2.5300000000000001E-3,null,2.0600000000000002E-3,null,null,2.0000000000000001E-4]
["MRC Argenteuil",0,0,3200,9.2825882199633336E-2,3400,9.7330844058144794E-2,6500,0.18841662804514306,20100,0.57874727203113296,33300,1500,4.2679373665945805E-2,34700,null,0,null,9.2825882199633336E-4,null,9.7330844058144794E-4,null,1.8841662804514306E-3,null,5.7874727203113298E-3,null,null,4.2679373665945806E-4]
["MRC Les Pays-d'en-Haut",15600,0.33187651899543769,14100,0.30153924871018634,9400,0.20005969385579669,4500,9.6064469364260441E-2,3300,7.0246876732187782E-2,46900,0,2.1319234213107061E-4,46900,null,3.3187651899543769E-3,null,3.0153924871018632E-3,null,2.0005969385579669E-3,null,9.6064469364260437E-4,null,7.0246876732187784E-4,null,null,2.1319234213107061E-6]
["MRC Les Laurentides",2800,5.573389526754239E-2,5300,0.10392500541583788,12600,0.2473560864170786,14100,0.27847253677846268,14000,0.27644405931819527,48800,1900,3.8068416802883198E-2,50800,null,5.573389526754239E-4,null,1.0392500541583788E-3,null,2.4735608641707858E-3,null,2.7847253677846266E-3,null,2.7644405931819527E-3,null,null,3.8068416802883201E-4]
["MRC Antoine-Labelle",0,0,700,1.8622127146069881E-2,2500,6.9195326641434921E-2,6200,0.16869617684164337,24500,0.67157588722505623,33800,2600,7.1910482145795623E-2,36500,null,0,null,1.8622127146069881E-4,null,6.9195326641434917E-4,null,1.6869617684164336E-3,null,6.7157588722505622E-3,null,null,7.1910482145795627E-4]
[]
["Défavorisation sociale 2021 MRC"]
["Répartition de la population (N, %) par quintile de défavorisation matérielle 2021\nRégion des Laurentides (variation régionale 2021)"]
[null,"Conditions\nplus favorables",null,null,null,null,null,null,null,"Conditions\nplus défavorables",null,"Population avec indice","Population\nsans indice",null,"Population totale"]
[null,"Quintile 1",null,"Quintile 2",null,"Quintile 3",null,"Quintile 4",null,"Quintile 5"]
[null,"N","%","N","%","N","%",null,null,null,null,"N","N","%","N"]
["Région des Laurentides",137500,0.21616098097783368,127500,0.20044018236126396,121600,0.19116491117748782,125300,0.19698160666561862,102900,0.16176701776450245,614600.46399999992,21400,3.3642509039459208E-2,636100]
["MRC Deux-Montagnes",22300,0.2188786109042449,27400,0.26856896484145337,17500,0.17177517344099086,14800,0.14501430643201504,17400,0.1700995570885431,99400,2600,2.6000000000000002E-2,102100,null,{"$f":"C924/100","v":2.188786109042449E-3},null,{"$f":"E924/100","v":2.6856896484145337E-3},null,{"$f":"G924/100","v":1.7177517344099085E-3},null,{"$f":"I924/100","v":1.4501430643201504E-3},null,{"$f":"K924/100","v":1.700995570885431E-3},null,null,{"$f":"N924/100","v":2.6000000000000003E-4}]
["MRC Thérèse-De Blainville",53300,0.32557201525374002,21700,0.13256575730908379,20000,0.12205436589420163,23800,0.14566221765913759,35000,0.21380903490759753,153800,9900,6.033660897623936E-2,163600,null,3.2557201525374004E-3,null,1.3256575730908379E-3,null,1.2205436589420163E-3,null,1.4566221765913759E-3,null,2.1380903490759752E-3,null,null,6.0336608976239363E-4]
["Mirabel",5900,9.6000000000000002E-2,10400,0.17,22000,0.35899999999999999,17400,0.28499999999999998,5500,0.09,61200,0,2.0363460200183286E-4,61100,null,9.6000000000000002E-4,null,1.7000000000000001E-3,null,3.5899999999999999E-3,null,2.8499999999999997E-3,null,8.9999999999999998E-4,null,null,2.0363460200183285E-6]
["MRC la Rivière-du-Nord",28300,0.2016189114678518,24200,0.1726551906495663,21200,0.15126226102528592,28300,0.20161178888645959,35400,0.25248838777065313,137400,2900,2.0363460200183287E-2,140400,null,2.0161891146785178E-3,null,1.726551906495663E-3,null,1.5126226102528592E-3,null,2.0161178888645961E-3,null,2.5248838777065315E-3,null,null,2.0363460200183286E-4]
["MRC Argenteuil",1600,4.5154374431469302E-2,8800,0.25208930355320319,7600,0.2191526840635046,7900,0.22614600018004188,7500,0.21477826410583517,33264.464,1500,4.2679373665945805E-2,34700,null,4.5154374431469299E-4,null,2.5208930355320319E-3,null,2.191526840635046E-3,null,2.261460001800419E-3,null,2.1477826410583518E-3,null,null,4.2679373665945806E-4]
["MRC Les Pays-d'en-Haut",200,3.7308659872937362E-3,8600,0.18276979490896686,12500,0.26695945081652667,16400,0.35001918731079179,9200,0.19630750863428986,46896,0,2.1319234213107061E-4,46900,null,3.7308659872937361E-5,null,1.8276979490896685E-3,null,2.6695945081652668E-3,null,3.5001918731079177E-3,null,1.9630750863428984E-3,null,null,2.1319234213107061E-6]
["MRC Les Laurentides",2200,4.2499556885991691E-2,11700,0.23122673651456366,11000,0.21751974319081474,12600,0.2486952754199736,11300,0.22199027118577308,48800,1900,3.8068416802883198E-2,50800,null,4.2499556885991691E-4,null,2.3122673651456366E-3,null,2.1751974319081475E-3,null,2.4869527541997363E-3,null,2.2199027118577309E-3,null,null,3.8068416802883201E-4]
["MRC Antoine-Labelle",9100,0.24842301574241676,9600,0.26419285831824912,9800,0.26781306565739676,3000,8.1646645823048647E-2,2400,6.6013932313093077E-2,33840,2600,7.1910482145795623E-2,36500,null,2.4842301574241675E-3,null,2.6419285831824914E-3,null,2.6781306565739679E-3,null,8.164664582304865E-4,null,6.6013932313093077E-4,null,null,7.1910482145795627E-4]
[]
[]
[]
[]
[]
[]
["Liste de toutes les municipalités par RLS"]
[]
["Défavorisation combinée 2021 RLS"]
[]
["Répartition de la population (N, %) par profil de défavorisation combinée 2021\nRégion des Laurentides (variation régionale 2021)"]
[null,"Conditions\nplus favorables",null,null,null,null,null,null,null,"Conditions\nplus défavorables",null,"Population\navec indice","Population\nsans indice",null,"Population\ntotale"]
[null,"Profil 1",null,"Profil 2",null,"Profil 3",null,"Profil 4",null,"Profil 5"]
[null,"matériellement \nET socialement \nplus favorables",null,"moyennes matériellement\nEt socialement",null,"socialement\nplus défavorables\n(pas matériellement)",null,"matériellement\nplus défavorables\n(pas socialement)",null,"matériellement\nET socialement\nplus défavorables"]
[null,"N","%","N","%","N","%","N","%","N","%","N","N","%","N"]
["Région des Laurentides",101800,0.16003772991667978,123800,0.19462348687313316,142900,0.22465021223078133,141000,0.22166326049363308,105100,0.16522559346014778,614600,21400,3.3642509039459208E-2,636100]
["RLS de Deux-Montagnes - Mirabel-Sud",22100,0.21121538711837839,31900,0.25159454344109122,25900,0.19311636116141739,26100,0.17386584715194786,13500,0.14874957729679816,119400,2600,2.1458283830367086E-2,122100,{"$f":"B948","v":22100},{"$f":"C948/100","v":2.1121538711837838E-3},{"$f":"D948","v":31900},{"$f":"E948/100","v":2.5159454344109121E-3},{"$f":"F948","v":25900},{"$f":"G948/100","v":1.9311636116141739E-3},{"$f":"H948","v":26100},{"$f":"I948/100","v":1.7386584715194785E-3},{"$f":"J948","v":13500},{"$f":"K948/100","v":1.4874957729679816E-3},{"$f":"L948","v":119400},{"$f":"M948","v":2600},{"$f":"N948/100","v":2.1458283830367086E-4},{"$f":"O948","v":122100}]
["    Deux-Montagnes",3000,0.15662852358358917,4300,0.18816634105498189,7100,0.14496232207647222,1500,0.1574099916271281,1100,0.301255930784259,17000,900,5.1576890873569627E-2,17900,{"$f":"B949","v":3000},{"$f":"C949/100","v":1.5662852358358918E-3},{"$f":"D949","v":4300},{"$f":"E949/100","v":1.881663410549819E-3},{"$f":"F949","v":7100},{"$f":"G949/100","v":1.4496232207647222E-3},{"$f":"H949","v":1500},{"$f":"I949/100","v":1.5740999162712809E-3},{"$f":"J949","v":1100},{"$f":"K949/100","v":3.0125593078425901E-3},{"$f":"L949","v":17000},{"$f":"M949","v":900},{"$f":"N949/100","v":5.1576890873569628E-4},{"$f":"O949","v":17900}]
["    Mirabel",0,0.17211061061914468,9000,0.16497552074085367,6400,0.30201861944788899,3700,0.32109279537083457,800,3.9802453821278082E-2,20000,0,0,20000,0,1.7211061061914467E-3,9000,1.6497552074085367E-3,6400,3.0201861944788898E-3,3700,3.2109279537083455E-3,800,3.9802453821278084E-4,20000,0,0,20000]
["    Oka",1800,0.15650201612903225,1100,0.7036290322580645,500,0,500,0.13734879032258066,0,0,4000,0,2.5201612903225806E-3,4000,1800,1.5650201612903225E-3,1100,7.0362903225806451E-3,500,0,500,1.3734879032258065E-3,0,0,4000,0,2.5201612903225806E-5,4000]
["    Pointe-Calumet",0,8.6451202037892069E-2,0,0.43798758159528739,500,0,3300,0.25680624104441968,2500,0.2187549753224009,6300,0,0,6300,0,8.6451202037892067E-4,0,4.3798758159528739E-3,500,0,3300,2.5680624104441967E-3,2500,2.1875497532240092E-3,6300,0,0,6300]
["    Sainte-Marthe-sur-le-Lac",6500,6.2332676668182048E-2,7100,0.36409557003586401,2300,0.41046623225741269,3000,0.1631055210385412,900,0,19800,0,0,19800,6500,6.2332676668182046E-4,7100,3.64095570035864E-3,2300,4.1046623225741265E-3,3000,1.631055210385412E-3,900,0,19800,0,0,19800]
["    Saint-Eustache",9300,0.30795564979238449,8800,0.19188974291015107,7400,0.11787702093824542,9800,0.11120682039049386,8200,0.2338545807933563,43600,1700,3.721618517536885E-2,45300,9300,3.0795564979238447E-3,8800,1.9188974291015108E-3,7400,1.1787702093824543E-3,9800,1.1120682039049386E-3,8200,2.338545807933563E-3,43600,1700,3.721618517536885E-4,45300]
["    Saint-Joseph-du-Lac",1500,0.45370502062295548,700,0.22173232826056041,1600,0.10311477741430806,3200,0.22144787370217606,0,0,7000,0,0,7000,1500,4.5370502062295551E-3,700,2.2173232826056041E-3,1600,1.0311477741430806E-3,3200,2.2144787370217607E-3,0,0,7000,0,0,7000]
["    Saint-Placide",0,0,700,0.58239910313901344,0,0.4176008968609865,1000,0,0,0,1800,0,0,1800,0,0,700,5.8239910313901341E-3,0,4.1760089686098652E-3,1000,0,0,0,1800,0,0,1800]
["RLS Thérèse-De Blainville",51900,0.31697956389948179,21500,0.13156350836022293,41300,0.25229783905348585,21500,0.13164906619732081,17500,0.10717341351324924,153800,9900,6.033660897623936E-2,163600]
["    Blainville",22800,0.38109965061268158,11000,0.18398836490078402,13800,0.23057891305438072,4900,8.248215449940656E-2,2600,4.2695464651699294E-2,55100,4700,7.9155452281047825E-2,59800]
["    Boisbriand",6200,0.21845414723753001,2700,9.4708209693372888E-2,7600,0.26812208562950401,7300,0.25717111770524231,4600,0.16154443973435073,28300,0,0,28300]
["    Bois-des-Filion",500,5.0300226400236243E-2,1700,0.16438625849000885,5300,0.52170489221380056,1700,0.17147357023329068,600,5.856875676739836E-2,9800,300,3.3566295895265282E-2,10200]
["    Lorraine",8700,0.91286045043148822,400,4.3990738791833295E-2,400,4.3148810776678592E-2,0,0,0,0,9500,0,0,9500]
["    Rosemère",9300,0.65833924769339958,1600,0.11156848828956707,3200,0.23009226401703337,0,0,0,0,14100,0,0,14100]
["    Sainte-Anne-des-Plaines",800,5.203337494251363E-2,1800,0.1162210104460942,0,0,7200,0.47572432823073385,3800,0.25037776755797908,13600,1600,0.10564351882267919,15200]
["    Sainte-Thérèse",3600,0.13696151961708061,2400,9.0905664644028189E-2,10900,0.41265593788866695,300,1.3002675913013982E-2,6000,0.22628424980213319,23300,3200,0.12018995213507708,26500]
["RLS de la Rivière-du-Nord - Mirabel-Nord",18600,0.16940872652123226,42200,0.17250627437330246,43600,0.20475156630898814,38400,0.21637938814619007,35800,0.22120265276358497,178600,2900,1.5751391886702104E-2,181500,{"$f":"B965","v":18600},{"$f":"C965/100","v":1.6940872652123225E-3},{"$f":"D965","v":42200},{"$f":"E965/100","v":1.7250627437330247E-3},{"$f":"F965","v":43600},{"$f":"G965/100","v":2.0475156630898814E-3},{"$f":"H965","v":38400},{"$f":"I965/100","v":2.1637938814619007E-3},{"$f":"J965","v":35800},{"$f":"K965/100","v":2.2120265276358497E-3},{"$f":"L965","v":178600},{"$f":"M965","v":2900},{"$f":"N965/100","v":1.5751391886702104E-4},{"$f":"O965","v":181500}]
["    Mirabel",5700,5.9402713740730702E-2,15900,0.17199768723488465,9700,0.38743121283727183,3800,0.26681451342086582,5900,0.11435387276624694,41100,0,0,41100,5700,5.9402713740730701E-4,15900,1.7199768723488466E-3,9700,3.8743121283727183E-3,3800,2.6681451342086583E-3,5900,1.1435387276624693E-3,41100,0,0,41100]
["    Prévost",4500,0.41221151037101955,1500,0.22056675430908559,4300,0,2600,0.19872918492550398,700,0.16849255039439087,13700,0,0,13700,4500,4.1221151037101958E-3,1500,2.2056675430908558E-3,4300,0,2600,1.98729184925504E-3,700,1.6849255039439086E-3,13700,0,0,13700]
["    Saint-Colomban",4900,0.60790544199070629,6700,0.2566162338648923,0,0.13547832414440142,6200,0,0,0,17700,0,0,17700,4900,6.0790544199070626E-3,6700,2.566162338648923E-3,0,1.3547832414440141E-3,6200,0,0,0,17700,0,0,17700]
["    Sainte-Sophie",0,0.17505530973451328,3200,0.26332964601769909,0,0.48949115044247793,13600,7.212389380530973E-2,1300,0,18100,0,0,18100,0,1.7505530973451328E-3,3200,2.6332964601769909E-3,0,4.8949115044247789E-3,13600,7.2123893805309735E-4,1300,0,18100,0,0,18100]
["    Saint-Hippolyte",1300,0.12287937013778234,3000,0.28400037491798669,1700,0.35589089886587311,3900,0.23722935607835788,800,0,10700,0,0,10700,1300,1.2287937013778234E-3,3000,2.8400037491798668E-3,1700,3.5589089886587312E-3,3900,2.3722935607835786E-3,800,0,10700,0,0,10700]
["    Saint-Jérôme",2200,9.2254372732599454E-2,11900,0.11065538005061523,27800,7.7119668881602738E-2,8300,0.27115305499108622,27100,0.4131749217707853,77400,2900,3.5642601573311061E-2,80200,2200,9.2254372732599452E-4,11900,1.1065538005061524E-3,27800,7.7119668881602736E-4,8300,2.7115305499108623E-3,27100,4.1317492177078531E-3,77400,2900,3.5642601573311063E-4,80200]
["RLS Argenteuil",1100,3.2504933309665418E-2,4800,0.13800000000000001,700,1.9E-2,12000,0.34600000000000003,14700,0.42200000000000004,33300,1500,4.2999999999999997E-2,34700]
["    Brownsburg-Chatham",0,0,1900,0.26065958327583827,700,9.2590037256795904E-2,2000,0.26976680005519527,2700,0.37698357941217053,7200,0,0,7200]
["    Gore",1100,0.49571290132299661,0,0,0,0,1100,0.5042870986770035,0,0,2300,0,0,2300]
["    Grenville",0,0,0,0,0,0,0,0,1800,1,1800,0,0,1800]
["    Grenville-sur-la-Rouge",0,0,0,0,0,0,2300,0.80298300381546994,600,0.19701699618452997,2900,0,0,2900]
["    Harrington",0,0,0,0,0,0,1000,1,0,0,1000,0,0,1000]
["    Lachute",0,0,800,5.3191489361702128E-2,0,0,2300,0.16546099290780142,9500,0.67617021276595746,12600,1500,0.105177304964539,14100]
["    Mille-Isles",0,0,900,0.50552004648460203,0,0,900,0.49447995351539803,0,0,1700,0,0,1700]
["    Saint-André-d'Argenteuil",0,0,600,0.20176875204716674,0,0,2400,0.79823124795283329,0,0,3100,0,0,3100]
["    Wentworth",0,0,700,1,0,0,0,0,0,0,700,0,0,700]
["RLS Les Pays-d'en-Haut",4600,9.8217712019784256E-2,12700,0.27132989383021361,21800,0.46392785571142281,3900,8.3912505862789408E-2,3900,8.2398840233658802E-2,46900,0,2.1319234213107061E-4,46900]
["    Estérel",300,1,0,0,0,0,0,0,0,0,300,0,0,300]
["    Lac-des-Seize-îles",200,1,0,0,0,0,0,0,0,0,200,0,0,200]
["    Morin-Heights",1100,0.22851646002565201,2700,0.57994869602394183,900,0.19153484395040615,0,0,0,0,4700,0,0,4700]
["    Piedmont",0,0,800,0.23388952819332565,2700,0.76611047180667446,0,0,0,0,3500,0,0,3500]
["    Saint-Adolphe-d'Howard",0,0,700,0.1932531380753138,800,0.21548117154811716,1400,0.36532426778242683,900,0.22594142259414227,3800,0,0,3800]
["    Sainte-Adèle",1100,8.0085653104925048E-2,2200,0.15902926481084939,9600,0.68386866523911494,0,0,1100,7.7016416845110638E-2,14000,0,0,14000]
["    Sainte-Anne-des-Lacs",0,0,3900,1,0,0,0,0,0,0,3900,0,0,3900]
["    Sainte-Marguerite-du-Lac-Masson",0,0,800,0.24383724383724384,0,0,1800,0.53786753786753783,700,0.21532521532521531,3400,0,2.9700029700029701E-3,3400]
["    Saint-Sauveur",2000,0.17089810017271156,600,5.2417962003454228E-2,7800,0.6733160621761658,0,0,1200,0.10336787564766839,11600,0,0,11600]
["    Wentworth-Nord",0,0,900,0.56459330143540665,0,0,700,0.4354066985645933,0,0,1700,0,0,1700]
["RLS Les Laurentides",2800,5.4394706264647381E-2,8800,0.17309017862418025,9100,0.17953010221163124,13400,0.2637611517025425,14800,0.29115544439411545,48800,1900,3.8068416802883198E-2,50800]
["    Amherst",0,0,0,0,0,0,1000,0.60185185185185186,700,0.39814814814814814,1700,0,0,1700]
["    Arundel",0,0,0,0,0,0,0,0,600,1,600,0,0,600]
["    Barkmere",0,0,0,0,0,0,0,0,0,0,0,100,1,100]
["    Brébeuf",0,0,0,0,0,0,600,0.554013875123885,500,0.445986124876115,1000,0,0,1000]
["    Huberdeau",0,0,0,0,0,0,0,0,900,1,900,0,0,900]
["    Ivry-sur-le-Lac",400,1,0,0,0,0,0,0,0,0,400,0,0,400]
["    La Conception",0,0,600,0.37851997380484614,0,0,900,0.62148002619515386,0,0,1500,0,0,1500]
["    La Minerve",0,0,700,0.45812807881773393,0,0,800,0.54187192118226601,0,0,1400,0,0,1400]
["    Labelle",0,0,800,0.27233273056057866,0,0,1500,0.54575045207956596,500,0.18191681735985538,2800,0,0,2800]
["    Lac-Supérieur",0,0,600,0.28346855983772817,0,0,1400,0.71653144016227177,0,0,2000,0,0,2000]
["    Lac-Tremblant-Nord",0,0,0,0,0,0,0,0,0,0,0,100,1,100]
["    Lantier",0,0,0,0,0,0,900,1,0,0,900,0,0,900]
["    Montcalm",0,0,600,1,0,0,0,0,0,0,600,0,0,600]
["    Mont-Tremblant",1600,0.14637918486171761,1100,9.6160844250363905E-2,2600,0.23981077147016014,0,0,4500,0.41184497816593885,9800,1200,0.1058042212518195,11000]
["    Sainte-Agathe-des-Monts",0,0,1800,0.16100258674516099,2700,0.24128088484524132,2200,0.19650343412719651,3900,0.34510748372134509,10600,600,5.6105610561056105E-2,11200]
["    Sainte-Lucie-des-Laurentides",0,0,0,0,0,0,1400,1,0,0,1400,0,0,1400]
["    Mont-Blanc",800,0.20158730158730159,600,0.15608465608465608,600,0.1492063492063492,1900,0.49312169312169307,0,0,3800,0,0,3800]
["    Val-David",0,0,1100,0.19773299748110829,3200,0.57772580064771506,0,0,1200,0.22454120187117665,5600,0,0,5600]
["    Val-des-Lacs",0,0,0,0,0,0,800,1,0,0,800,0,0,800]
["    Val-Morin",0,0,1100,0.34101825168107586,0,0,0,0,2100,0.65898174831892409,3100,0,0,3100]
["RLS Antoine-Labelle",700,1.8622127146069881E-2,2000,5.6140639569963249E-2,500,1.3054687071471669E-2,25700,0.7056661730020295,4900,0.13460589106467008,33800,2600,7.1910482145795623E-2,36500]
["    Chute-Saint-Philippe",0,0,0,0,0,0,1000,1,0,0,1000,0,0,1000]
["    Ferme-Neuve",0,0,0,0,0,0,2300,0.84020618556701043,400,0.15979381443298968,2700,0,0,2700]
["    Kiamika",0,0,0,0,0,0,800,1,0,0,800,0,0,800]
["    La Macaza",0,0,0,0,0,0,500,0.41590493601462525,0,0,500,600,0.58409506398537481,1100]
["    Lac-des-Écorces",0,0,0,0,0,0,2300,0.81351819757365684,500,0.18648180242634316,2900,0,0,2900]
["    Lac-du-Cerf",0,0,0,0,0,0,400,1,0,0,400,0,0,400]
["    Lac-Saguay",0,0,0,0,0,0,500,1,0,0,500,0,0,500]
["    Lac-Saint-Paul",0,0,0,0,0,0,500,1,0,0,500,0,0,500]
["    L'Ascension",0,0,0,0,0,0,900,1,0,0,900,0,0,900]
["    Mont-Laurier",700,4.8000000000000001E-2,2000,0.14400000000000002,500,3.4000000000000002E-2,6200,0.43942172073342739,2800,0.19527503526093087,12200,2000,0.13949224259520451,14200]
["    Mont-Saint-Michel",0,0,0,0,0,0,600,1,0,0,600,0,0,600]
["    Nominingue",0,0,0,0,0,0,1900,0.85277161862527717,300,0.14722838137472283,2300,0,0,2300]
["    Notre-Dame-de-Pontmain",0,0,0,0,0,0,800,1,0,0,800,0,0,800]
["    Notre-Dame-du-Laus",0,0,0,0,0,0,1700,1,0,0,1700,0,0,1700]
["    Rivière-Rouge",0,0,0,0,0,0,3800,0.81969337076225424,800,0.18030662923774565,4600,0,0,4600]
["    Saint-Aimé-du-Lac-des-îles",0,0,0,0,0,0,800,1,0,0,800,0,0,800]
["    Sainte-Anne-du-Lac",0,0,0,0,0,0,600,0.9910873440285205,0,0,600,0,8.9126559714795012E-3,600]
["   Territoires non organisés","ND","ND","ND","ND","ND","ND","ND","ND","ND","ND","ND","ND","ND","ND"]
[]
[]
["Défavorisation matérielle 2021 RLS"]
["Répartition de la population (N, %) par quintile de défavorisation matérielle 2021\nRégion des Laurentides (variation régionale 2021)"]
[null,"Conditions\nplus favorables",null,null,null,null,null,null,null,"Conditions\nplus défavorables",null,"Population avec indice","Population\nsans indice",null,"Population totale"]
[null,"Quintile 1",null,"Quintile 2",null,"Quintile 3",null,"Quintile 4",null,"Quintile 5"]
[null,"N","%","N","%","N","%",null,null,null,null,"N","N","%","N"]
["Région des Laurentides",117400,0.18456217575852854,128200,0.20154063826442384,123000,0.19336582298380758,122800,0.19305140701147619,123300,0.19383744694230468,614600,21400,3.3642509039459208E-2,636100]
["RLS de Deux-Montagnes - Mirabel-Sud",14200,0.11638599534569087,38900,0.31846420104840478,26700,0.21911346939753357,24600,0.20185043163227318,15000,0.12272761874573063,119400,2600,2.1458283830367086E-2,122100,{"$f":"B1041","v":14200},{"$f":"C1041/100","v":1.1638599534569086E-3},{"$f":"D1041","v":38900},{"$f":"E1041/100","v":3.1846420104840478E-3},{"$f":"F1041","v":26700},{"$f":"G1041/100","v":2.1911346939753355E-3},{"$f":"H1041","v":24600},{"$f":"I1041/100","v":2.0185043163227319E-3},{"$f":"J1041","v":15000},{"$f":"K1041/100","v":1.2272761874573062E-3},{"$f":"L1041","v":119400},{"$f":"M1041","v":2600},{"$f":"N1041/100","v":2.1458283830367086E-4},{"$f":"O1041","v":122100}]
["    Deux-Montagnes",4100,0.23097962601172203,4200,0.23298911526653643,6100,0.33999441808540332,2100,0.11521071727602568,500,2.9249232486742952E-2,17000,900,5.1576890873569627E-2,17900,{"$f":"B1042","v":4100},{"$f":"C1042/100","v":2.3097962601172205E-3},{"$f":"D1042","v":4200},{"$f":"E1042/100","v":2.3298911526653645E-3},{"$f":"F1042","v":6100},{"$f":"G1042/100","v":3.3999441808540334E-3},{"$f":"H1042","v":2100},{"$f":"I1042/100","v":1.1521071727602567E-3},{"$f":"J1042","v":500},{"$f":"K1042/100","v":2.924923248674295E-4},{"$f":"L1042","v":17000},{"$f":"M1042","v":900},{"$f":"N1042/100","v":5.1576890873569628E-4},{"$f":"O1042","v":17900}]
["    Mirabel",0,0,10300,0.51322164011411298,5200,0.26036440146535034,2600,0.13080806431716516,1900,9.5605894103371475E-2,20000,0,0,20000,0,0,10300,5.1322164011411301E-3,5200,2.6036440146535032E-3,2600,1.3080806431716517E-3,1900,9.5605894103371479E-4,20000,0,0,20000]
["    Oka",600,0.15045362903225806,1200,0.30090725806451613,1700,0.41658266129032256,0,0,500,0.12953629032258066,4000,0,2.5201612903225806E-3,4000,600,1.5045362903225805E-3,1200,3.0090725806451611E-3,1700,4.1658266129032256E-3,0,0,500,1.2953629032258066E-3,4000,0,2.5201612903225806E-5,4000]
["    Pointe-Calumet",0,0,0,0,500,8.0560420315236414E-2,3900,0.61869129119566946,1900,0.30074828848909407,6300,0,0,6300,0,0,0,0,500,8.0560420315236409E-4,3900,6.1869129119566943E-3,1900,3.0074828848909406E-3,6300,0,0,6300]
["    Sainte-Marthe-sur-le-Lac",700,3.4550689498408851E-2,11300,0.5719553467697126,3900,0.19689851997777441,3500,0.17689548921553772,400,1.9699954538566451E-2,19800,0,0,19800,700,3.455068949840885E-4,11300,5.7195534676971263E-3,3900,1.9689851997777442E-3,3500,1.7689548921553772E-3,400,1.969995453856645E-4,19800,0,0,19800]
["    Saint-Eustache",8200,0.18208322289954942,8600,0.19096209912536444,8700,0.19133757399063522,9400,0.20869776482021379,8600,0.18970315398886828,43600,1700,3.721618517536885E-2,45300,8200,1.8208322289954943E-3,8600,1.9096209912536444E-3,8700,1.9133757399063523E-3,9400,2.0869776482021381E-3,8600,1.8970315398886828E-3,43600,1700,3.721618517536885E-4,45300]
["    Saint-Joseph-du-Lac",500,7.7087185322144786E-2,2500,0.35883942540179203,700,0.10311477741430806,2600,0.36495519840705448,700,9.6003413454700592E-2,7000,0,0,7000,500,7.7087185322144783E-4,2500,3.5883942540179204E-3,700,1.0311477741430806E-3,2600,3.6495519840705447E-3,700,9.6003413454700593E-4,7000,0,0,7000]
["    Saint-Placide",0,0,700,0.4176008968609865,0,0,600,0.3099775784753363,500,0.27242152466367714,1800,0,0,1800,0,0,700,4.1760089686098652E-3,0,0,600,3.0997757847533629E-3,500,2.7242152466367712E-3,1800,0,0,1800]
["RLS Thérèse-De Blainville",67900,0.41518162706561063,26800,0.16372714383494671,20000,0.12193214041263323,24900,0.15209127798963529,14200,8.6731201720934778E-2,153800,9900,6.033660897623936E-2,163600,null,0.39,null,0.26300000000000001,null,0.126,null,0.12,null,0.1,null,null,5.0387325512561823E-2]
["    Blainville",27900,0.46565472508734684,12200,0.20446680820475099,7500,0.12554539527574851,6000,9.9466724619268129E-2,1500,2.5710894531837711E-2,55100,4700,7.9155452281047825E-2,59800,null,0.3302707930367505,null,0.23378217527153697,null,0.18643059068590984,null,8.8454099092396946E-2,null,0.16106234191340574,null,null,0]
["    Boisbriand",10400,0.36759926522537806,3100,0.10788469690546842,3000,0.10580048042956054,8300,0.29203758654797229,3600,0.12667797089162075,28300,0,0,28300,null,0.26007651926327963,null,0.24130260699350475,null,0.12590088086128659,null,0.23485185514725507,null,0.13786813773467391,null,null,0.13509561737658241]
["    Bois-des-Filion",3100,0.30475440496111822,1200,0.12058273452111429,3200,0.31105423762181317,1700,0.16251599566886504,700,6.7526331331823994E-2,9800,300,3.3566295895265282E-2,10200,null,0.39742861852347028,null,0.36107397300415739,null,0.11527261405468764,null,8.791047783007637E-2,null,3.8314316587608283E-2,null,null,3.9779821676661449E-2]
["    Lorraine",8100,0.85129446432330047,1400,0.14870553567669964,0,0,0,0,0,0,9500,0,0,9500,null,0.83371858921780628,null,0.16628141078219372,null,0,null,0,null,0,null,null,3.9188995558102881E-2]
["    Rosemère",10700,0.75684882895670702,3400,0.24315117104329309,0,0,0,0,0,0,14100,0,0,14100,null,0.80656544054747636,null,0.14863130881094952,null,4.4803250641573998E-2,null,0,null,0,null,null,0]
["    Sainte-Anne-des-Plaines",500,3.3506339925103476E-2,800,5.203337494251363E-2,1300,8.2714670520990741E-2,5100,0.33729715524604165,5900,0.38880494054267134,13600,1600,0.10564351882267919,15200,null,0.32943574340270326,null,0.3532503754559107,null,0.15930057927483374,null,0.15801330186655224,null,0,null,null,3.2586135325861354E-2]
["    Sainte-Thérèse",7300,0.27576979610296609,4700,0.17525345795801456,5000,0.18949986808879507,3900,0.14642143745524441,2500,9.2865488259902762E-2,23300,3200,0.12018995213507708,26500,null,0,null,6.5758429104193619E-2,null,0.21219270872973589,null,0.30626379480934623,null,0.41578506735672427,null,null,8.8898134664725056E-2]
["RLS de la Rivière-du-Nord - Mirabel-Nord",16900,9.3059377530005344E-2,39200,0.21600031897257249,48400,0.26640200177877782,42000,0.23125180939224702,32200,0.17753510043969523,178600,2900,1.5751391886702104E-2,181500,{"$f":"B1058","v":16900},{"$f":"C1058/100","v":9.3059377530005339E-4},{"$f":"D1058","v":39200},{"$f":"E1058/100","v":2.1600031897257249E-3},{"$f":"F1058","v":48400},{"$f":"G1058/100","v":2.6640200177877782E-3},{"$f":"H1058","v":42000},{"$f":"I1058/100","v":2.31251809392247E-3},{"$f":"J1058","v":32200},{"$f":"K1058/100","v":1.7753510043969523E-3},{"$f":"L1058","v":178600},{"$f":"M1058","v":2900},{"$f":"N1058/100","v":1.5751391886702104E-4},{"$f":"O1058","v":181500}]
["    Mirabel",7000,0.17071590705669454,15200,0.36992176429076168,9200,0.22289476916292744,6400,0.15578008959690393,3300,8.068746989271243E-2,41100,0,0,41100,7000,1.7071590705669453E-3,15200,3.6992176429076168E-3,9200,2.2289476916292745E-3,6400,1.5578008959690392E-3,3300,8.0687469892712425E-4,41100,0,0,41100]
["    Prévost",3300,0.24174700555068654,4600,0.33939526730937769,2400,0.17586912065439672,3300,0.24298860648553899,0,0,13700,0,0,13700,3300,2.4174700555068653E-3,4600,3.3939526730937769E-3,2400,1.7586912065439672E-3,3300,2.4298860648553897E-3,0,0,13700,0,0,13700]
["    Saint-Colomban",400,2.423281172300025E-2,4500,0.25103705163099221,6700,0.3760594247153039,5400,0.30482622932490316,800,4.3844482605800456E-2,17700,0,0,17700,400,2.4232811723000249E-4,4500,2.5103705163099219E-3,6700,3.7605942471530388E-3,5400,3.0482622932490318E-3,800,4.3844482605800457E-4,17700,0,0,17700]
["    Sainte-Sophie",0,0,0,0,3200,0.17704646017699116,8800,0.48761061946902656,6100,0.33534292035398233,18100,0,0,18100,0,0,0,0,3200,1.7704646017699117E-3,8800,4.8761061946902655E-3,6100,3.3534292035398232E-3,18100,0,0,18100]
["    Saint-Hippolyte",2000,0.18361608398162901,2200,0.20254944230949479,1900,0.17733620770456462,4700,0.43649826600431152,0,0,10700,0,0,10700,2000,1.8361608398162902E-3,2200,2.025494423094948E-3,1900,1.7733620770456462E-3,4700,4.3649826600431155E-3,0,0,10700,0,0,10700]
["    Saint-Jérôme",4200,5.2036452944036506E-2,12700,0.15877725555707928,25000,0.3118821138718163,13400,0.16656901001084612,22100,0.27509256604291077,77400,2900,3.5642601573311061E-2,80200,4200,5.2036452944036508E-4,12700,1.5877725555707928E-3,25000,3.1188211387181632E-3,13400,1.6656901001084613E-3,22100,2.7509256604291077E-3,77400,2900,3.5642601573311063E-4,80200]
["RLS Argenteuil",0,0,3200,9.2825882199633336E-2,3400,9.7330844058144794E-2,6500,0.18841662804514306,20100,0.57874727203113296,33300,1500,4.2679373665945805E-2,34700,null,0,null,1.7000000000000001E-2,null,9.9000000000000005E-2,null,0.33399999999999996,null,0.54899999999999993,null,null,3.5444132267127726E-2]
["    Brownsburg-Chatham",0,0,700,9.1624120325651995E-2,1900,0.26162550020698222,800,0.10349109976542017,3900,0.54325927970194565,7200,0,0,7200,null,0,null,0,null,0,null,0.45430463576158941,null,0.54569536423841059,null,null,0]
["    Gore",0,0,1100,0.49571290132299661,0,0,0,0,1100,0.5042870986770035,2300,0,0,2300,null,0,null,0,null,0,null,0.31927607990438789,null,0.68072392009561211,null,null,8.9255170269009476E-2]
["    Grenville",0,0,0,0,0,0,1000,0.56057268722466957,800,0.43942731277533037,1800,0,0,1800,null,0,null,0,null,0.47006302521008403,null,0,null,0.52993697478991597,null,null,0]
["    Grenville-sur-la-Rouge",0,0,0,0,0,0,600,0.19701699618452997,2300,0.80298300381546994,2900,0,0,2900,null,0,null,0,null,0.52201659221442243,null,0.47798340778557752,null,0,null,null,0]
["    Harrington",0,0,0,0,0,0,0,0,1000,1,1000,0,0,1000,null,0,null,1,null,0,null,0,null,0,null,null,0]
["    Lachute",0,0,800,5.3191489361702128E-2,0,0,2700,0.18822695035460993,9200,0.65340425531914892,12600,1500,0.105177304964539,14100,null,0,null,0,null,9.4636338107273232E-2,null,0.36141533277169335,null,0.54394832912103341,null,null,0]
["    Mille-Isles",0,0,0,0,900,0.50552004648460203,900,0.49447995351539803,0,0,1700,0,0,1700,null,0,null,0,null,0,null,0.41218130311614731,null,0.58781869688385269,null,null,0]
["    Saint-André-d'Argenteuil",0,0,0,0,600,0.20176875204716674,700,0.23124795283327873,1700,0.56698329511955459,3100,0,0,3100,null,0,null,0,null,0.41554646405610751,null,0,null,0.58445353594389249,null,null,0]
["    Wentworth",0,0,700,1,0,0,0,0,0,0,700,0,0,700,null,0,null,0,null,0,null,1,null,0,null,null,0]
["RLS Les Pays-d'en-Haut",15600,0.33187651899543769,14100,0.30153924871018634,9400,0.20005969385579669,4500,9.6064469364260441E-2,3300,7.0246876732187782E-2,46900,0,2.1319234213107061E-4,46900,null,0.42799999999999999,null,0.22500000000000001,null,0.185,null,9.6999999999999989E-2,null,6.5000000000000002E-2,null,null,2.106168063614872E-2]
["    Estérel",300,1,0,0,0,0,0,0,0,0,300,0,0,300,null,0,null,1,null,0,null,0,null,0,null,null,0]
["    Lac-des-Seize-îles",0,0,200,1,0,0,0,0,0,0,200,0,0,200,null,0,null,0,null,0.53541590991645482,null,0,null,0.46458409008354523,null,null,3.619254433586681E-3]
["    Morin-Heights",2900,0.63018383924754173,1700,0.36981616075245832,0,0,0,0,0,0,4700,0,0,4700,null,0.14118739840544933,null,0.35203963155042961,null,0.21541915008901619,null,0.24909048687978946,null,4.2263333075315428E-2,null,null,0]
["    Piedmont",1300,0.38607594936708867,2100,0.61392405063291144,0,0,0,0,0,0,3500,0,0,3500,null,1,null,0,null,0,null,0,null,0,null,null,0]
["    Saint-Adolphe-d'Howard",700,0.1932531380753138,0,0,800,0.21548117154811716,1600,0.41788702928870292,700,0.17337866108786615,3800,0,0,3800,null,0.79562448075325387,null,0.20437551924674605,null,0,null,0,null,0,null,null,0]
["    Sainte-Adèle",3900,0.27723054960742327,3500,0.25024982155603143,5500,0.39550321199143468,0,0,1100,7.7016416845110638E-2,14000,0,0,14000,null,0.70370766107490113,null,0.23421305695052891,null,6.2079281974569932E-2,null,0,null,0,null,null,8.5231160199393988E-2]
["    Sainte-Anne-des-Lacs",3200,0.832470222682548,0,0,600,0.16752977731745211,0,0,0,0,3900,0,0,3900,null,0.45983112183353436,null,0.20530759951749095,null,0.33486127864897469,null,0,null,0,null,null,0]
["    Sainte-Marguerite-du-Lac-Masson",0,0,0,0,800,0.24383724383724384,1700,0.50816750816750822,800,0.245025245025245,3400,0,2.9700029700029701E-3,3400,null,0,null,0,null,0,null,0,null,1,null,null,0]
["    Saint-Sauveur",3200,0.27435233160621764,6600,0.56986183074265973,600,5.2417962003454228E-2,1200,0.10336787564766839,0,0,11600,0,0,11600,null,0,null,0.51629254163649529,null,0,null,0,null,0.48370745836350471,null,null,0]
["    Wentworth-Nord",0,0,0,0,900,0.56459330143540665,0,0,700,0.4354066985645933,1700,0,0,1700,null,0.39925904816186952,null,0,null,0.38757480763750357,null,0.21316614420062696,null,0,null,null,0]
["RLS Les Laurentides",2800,5.573389526754239E-2,5300,0.10392500541583788,12600,0.2473560864170786,14100,0.27847253677846268,14000,0.27644405931819527,48800,1900,3.8068416802883198E-2,50800,null,0.10734608208955225,null,8.4000000000000005E-2,null,0.21,null,0.25900000000000001,null,0.33899999999999997,null,null,6.6000000000000003E-2]
["    Amherst",0,0,0,0,0,0,0,0,1700,1,1700,0,0,1700,null,0,null,0,null,0.52787456445993031,null,0.47212543554006969,null,0,null,null,0]
["    Arundel",0,0,0,0,0,0,600,1,0,0,600,0,0,600,null,0.14073622127313404,null,0.22493390278625178,null,0.4077689648159446,null,0.2265609111246695,null,0,null,null,0]
["    Barkmere",0,0,0,0,0,0,0,0,0,0,0,100,1,100,null,0,null,0,null,0,null,0,null,1,null,null,0]
["    Brébeuf",0,0,0,0,0,0,500,0.445986124876115,600,0.554013875123885,1000,0,0,1000,null,0,null,0,null,0,null,0,null,1,null,null,0]
["    Huberdeau",0,0,0,0,0,0,500,0.5330243337195828,400,0.46697566628041715,900,0,0,900,null,0.15097125979779621,null,0,null,0.12779734181529023,null,0.19050323753265933,null,0.53072816085425423,null,null,0.13890247481169912]
["    Ivry-sur-le-Lac",400,1,0,0,0,0,0,0,0,0,400,0,0,400,null,0,null,0,null,1,null,0,null,0,null,null,0]
["    La Conception",0,0,0,0,600,0.37851997380484614,0,0,900,0.62148002619515386,1500,0,0,1500,null,0.13918262360674477,null,0,null,0,null,0.72849385538725353,null,0.13232352100600173,null,null,0]
["    La Minerve",0,0,0,0,700,0.45812807881773393,800,0.54187192118226601,0,0,1400,0,0,1400,null,0,null,0,null,1,null,0,null,0,null,null,0]
["    Labelle",0,0,0,0,800,0.27233273056057866,900,0.33200723327305603,1100,0.3956600361663653,2800,0,0,2800,null,0,null,0,null,0,null,0,null,1,null,null,0]
["    Lac-Supérieur",0,0,0,0,600,0.28346855983772817,800,0.38083164300202837,700,0.3356997971602434,2000,0,0,2000,null,1,null,0,null,0,null,0,null,0,null,null,0]
["    Lac-Tremblant-Nord",0,0,0,0,0,0,0,0,0,0,0,100,1,100,null,0,null,0,null,0,null,1,null,0,null,null,0]
["    Lantier",0,0,0,0,0,0,0,0,900,1,900,0,0,900,null,0,null,0,null,0,null,0,null,1,null,null,0]
["    Montcalm",0,0,0,0,600,1,0,0,0,0,600,0,0,600,null,0,null,0,null,0.41598360655737709,null,0,null,0.58401639344262291,null,null,0]
["    Mont-Tremblant",2400,0.22188864628820962,800,7.4508733624454149E-2,2000,0.18595342066957787,3100,0.2802037845705968,1400,0.13164119359534207,9800,1200,0.1058042212518195,11000,null,0,null,0.2701271186440678,null,0.7298728813559322,null,0,null,0,null,null,0]
["    Sainte-Agathe-des-Monts",0,0,700,6.2706270627062702E-2,3800,0.3395772009633396,1800,0.15823744536615825,4300,0.3833734724823834,10600,600,5.6105610561056105E-2,11200,null,0,null,0,null,0,null,0,null,1,null,null,0]
["    Sainte-Lucie-des-Laurentides",0,0,0,0,0,0,700,0.46228373702422149,800,0.53771626297577857,1400,0,0,1400,null,0.19045251118846346,null,0.17217802088513179,null,9.087518647439087E-2,null,0.34124813525609149,null,0.20524614619592241,null,null,0.16607920381505287]
["    Mont-Blanc",0,0,1400,0.35767195767195775,600,0.1492063492063492,600,0.16798941798941802,1200,0.32513227513227511,3800,0,0,3800,null,0,null,0.41810022438294697,null,0.58189977561705308,null,0,null,0,null,null,0]
["    Val-David",0,0,2400,0.4323497661029147,1900,0.34310903202590859,1200,0.22454120187117665,0,0,5600,0,0,5600,null,0,null,0,null,0.25353249899071456,null,0.32377876463463873,null,0.42268873637464677,null,null,0]
["    Val-des-Lacs",0,0,0,0,0,0,800,1,0,0,800,0,0,800,null,0,null,1,null,0,null,0,null,0,null,null,0]
["    Val-Morin",0,0,0,0,1100,0.34101825168107586,2100,0.65898174831892409,0,0,3100,0,0,3100,null,0,null,0,null,0,null,0,null,1,null,null,0]
["RLS Antoine-Labelle",0,0,700,1.8622127146069881E-2,2500,6.9195326641434921E-2,6200,0.16869617684164337,24500,0.67157588722505623,33800,2600,7.1910482145795623E-2,36500,null,0,null,1.7000000000000001E-2,null,7.6999999999999999E-2,null,0.14899999999999999,null,0.75800000000000001,null,null,8.3903186448372746E-2]
["    Chute-Saint-Philippe",0,0,0,0,0,0,0,0,1000,1,1000,0,0,1000,null,0,null,0,null,0,null,0,null,1,null,null,0]
["    Ferme-Neuve",0,0,0,0,0,0,400,0.14653902798232696,2300,0.85346097201767313,2700,0,0,2700,null,0,null,0,null,0,null,0,null,1,null,null,0]
["    Kiamika",0,0,0,0,0,0,0,0,800,1,800,0,0,800,null,0,null,0,null,0,null,0,null,1,null,null,0]
["    La Macaza",0,0,0,0,0,0,0,0,500,0.41590493601462525,500,600,0.58409506398537481,1100,null,0,null,0,null,0,null,0,null,1,null,null,0]
["    Lac-des-Écorces",0,0,0,0,0,0,500,0.18890814558058924,2300,0.81109185441941078,2900,0,0,2900,null,0,null,0,null,0,null,0,null,1,null,null,0]
["    Lac-du-Cerf",0,0,0,0,0,0,0,0,400,1,400,0,0,400,null,0,null,0,null,0.28685072531586336,null,0.16612072999532054,null,0.54702854468881612,null,null,0]
["    Lac-Saguay",0,0,0,0,0,0,0,0,500,1,500,0,0,500,null,0,null,0,null,0.16728366496992134,null,0.12656177695511336,null,0.7061545580749653,null,null,0]
["    Lac-Saint-Paul",0,0,0,0,0,0,0,0,500,1,500,0,0,500,null,0,null,0,null,0,null,1,null,0,null,null,0.61799999999999999]
["    L'Ascension",0,0,0,0,0,0,0,0,900,1,900,0,0,900,null,0,null,0,null,0,null,0,null,1,null,null,0]
["    Mont-Laurier",0,0,700,4.7884344146685472E-2,2500,0.17792665726375176,2700,0.18702397743300422,6300,0.44767277856135401,12200,2000,0.13949224259520451,14200,null,0,null,0,null,0,null,0,null,1,null,null,0]
["    Mont-Saint-Michel",0,0,0,0,0,0,0,0,600,1,600,0,0,600,null,0,null,0,null,0,null,0.4713375796178344,null,0.5286624203821656,null,null,0]
["    Nominingue",0,0,0,0,0,0,700,0,1500,1,2300,0,0,2300,null,0,null,0,null,0.25164594001463059,null,0,null,0.74835405998536941,null,null,0]
["    Notre-Dame-de-Pontmain",0,0,0,0,0,0,0,0.32283813747228379,800,0.67716186252771626,800,0,0,800,null,0,null,4.5305263157894737E-2,null,3.8821052631578951E-2,null,0.25355789473684209,null,0.66231578947368419,null,null,0.159]
["    Notre-Dame-du-Laus",0,0,0,0,0,0,500,0,1200,1,1700,0,0,1700,null,0,null,0,null,0,null,0,null,1,null,null,0]
["    Rivière-Rouge",0,0,0,0,0,0,1300,0.28728323699421965,3300,0.71271676300578035,4600,0,0,4600,null,0,null,0,null,0,null,0,null,1,null,null,0]
["    Saint-Aimé-du-Lac-des-îles",0,0,0,0,0,0,0,0.28741092636579574,800,0.71258907363420432,800,0,0,800,null,0,null,0,null,0,null,0,null,1,null,null,0]
["    Sainte-Anne-du-Lac",0,0,0,0,0,0,0,0,600,0.9910873440285205,600,0,8.9126559714795012E-3,600,null,0,null,0,null,0,null,0,null,1,null,null,0]
["   Territoires non organisés","ND","ND","ND","ND","ND","ND","ND","ND","ND","ND","ND","ND","ND","ND",null,0,null,0,null,0,null,0,null,0,null,null,1]
[]
[]
["Défavorisation sociale 2021 RLS"]
["Répartition de la population (N, %) par quintile de défavorisation sociale 2021\nRégion des Laurentides (variation régionale 2021)"]
[null,"Conditions\nplus favorables",null,null,null,null,null,null,null,"Conditions\nplus défavorables",null,"Population avec indice","Population\nsans indice",null,"Population totale"]
[null,"Quintile 1",null,"Quintile 2",null,"Quintile 3",null,"Quintile 4",null,"Quintile 5"]
[null,"N","%","N","%","N","%",null,null,null,null,"N","N","%","N"]
["Région des Laurentides",137500,0.21616098097783368,127500,0.20044018236126396,121600,0.19116491117748782,125300,0.19698160666561862,102900,0.16176701776450245,614600.46399999992,21400,3.3642509039459208E-2,636100]
["RLS de Deux-Montagnes - Mirabel-Sud",25800,0.21121538711837839,30700,0.25159454344109122,23600,0.19311636116141739,21200,0.17386584715194786,18200,0.14874957729679816,119400,2600,2.1458283830367086E-2,122100,{"$f":"B1134","v":25800},{"$f":"C1134/100","v":2.1121538711837838E-3},{"$f":"D1134","v":30700},{"$f":"E1134/100","v":2.5159454344109121E-3},{"$f":"F1134","v":23600},{"$f":"G1134/100","v":1.9311636116141739E-3},{"$f":"H1134","v":21200},{"$f":"I1134/100","v":1.7386584715194785E-3},{"$f":"J1134","v":18200},{"$f":"K1134/100","v":1.4874957729679816E-3},{"$f":"L1134","v":119400},{"$f":"M1134","v":2600},{"$f":"N1134/100","v":2.1458283830367086E-4},{"$f":"O1134","v":122100}]
["    Deux-Montagnes",2800,0.15662852358358917,3400,0.18816634105498189,2600,0.14496232207647222,2800,0.1574099916271281,5400,0.301255930784259,17000,900,5.1576890873569627E-2,17900,{"$f":"B1135","v":2800},{"$f":"C1135/100","v":1.5662852358358918E-3},{"$f":"D1135","v":3400},{"$f":"E1135/100","v":1.881663410549819E-3},{"$f":"F1135","v":2600},{"$f":"G1135/100","v":1.4496232207647222E-3},{"$f":"H1135","v":2800},{"$f":"I1135/100","v":1.5740999162712809E-3},{"$f":"J1135","v":5400},{"$f":"K1135/100","v":3.0125593078425901E-3},{"$f":"L1135","v":17000},{"$f":"M1135","v":900},{"$f":"N1135/100","v":5.1576890873569628E-4},{"$f":"O1135","v":17900}]
["    Mirabel",3400,0.17211061061914468,3300,0.16497552074085367,6000,0.30201861944788899,6400,0.32109279537083457,800,3.9802453821278082E-2,20000,0,0,20000,3400,1.7211061061914467E-3,3300,1.6497552074085367E-3,6000,3.0201861944788898E-3,6400,3.2109279537083455E-3,800,3.9802453821278084E-4,20000,0,0,20000]
["    Oka",600,0.15650201612903225,2800,0.7036290322580645,0,0,500,0.13734879032258066,0,0,4000,0,2.5201612903225806E-3,4000,600,1.5650201612903225E-3,2800,7.0362903225806451E-3,0,0,500,1.3734879032258065E-3,0,0,4000,0,2.5201612903225806E-5,4000]
["    Pointe-Calumet",500,8.6451202037892069E-2,2800,0.43798758159528739,0,0,1600,0.25680624104441968,1400,0.2187549753224009,6300,0,0,6300,500,8.6451202037892067E-4,2800,4.3798758159528739E-3,0,0,1600,2.5680624104441967E-3,1400,2.1875497532240092E-3,6300,0,0,6300]
["    Sainte-Marthe-sur-le-Lac",1200,6.2332676668182048E-2,7200,0.36409557003586401,8100,0.41046623225741269,3200,0.1631055210385412,0,0,19800,0,0,19800,1200,6.2332676668182046E-4,7200,3.64095570035864E-3,8100,4.1046623225741265E-3,3200,1.631055210385412E-3,0,0,19800,0,0,19800]
["    Saint-Eustache",13900,0.30795564979238449,8700,0.19188974291015107,5300,0.11787702093824542,5000,0.11120682039049386,10600,0.2338545807933563,43600,1700,3.721618517536885E-2,45300,13900,3.0795564979238447E-3,8700,1.9188974291015108E-3,5300,1.1787702093824543E-3,5000,1.1120682039049386E-3,10600,2.338545807933563E-3,43600,1700,3.721618517536885E-4,45300]
["    Saint-Joseph-du-Lac",3200,0.45370502062295548,1600,0.22173232826056041,700,0.10311477741430806,1600,0.22144787370217606,0,0,7000,0,0,7000,3200,4.5370502062295551E-3,1600,2.2173232826056041E-3,700,1.0311477741430806E-3,1600,2.2144787370217607E-3,0,0,7000,0,0,7000]
["    Saint-Placide",0,0,1000,0.58239910313901344,700,0.4176008968609865,0,0,0,0,1800,0,0,1800,0,0,1000,5.8239910313901341E-3,700,4.1760089686098652E-3,0,0,0,0,1800,0,0,1800]
["RLS Thérèse-De Blainville",53300,0.32557201525374002,21700,0.13256575730908379,20000,0.12205436589420163,23800,0.14566221765913759,35000,0.21380903490759753,153800,9900,6.033660897623936E-2,163600,null,0.29705001105994489,null,0.16429045426210059,null,0.14548854792977942,null,0.15947099948386922,null,0.23369998726430588,null,null,5.0387325512561823E-2]
["    Blainville",27900,0.46565472508734684,12200,0.20446680820475099,7500,0.12554539527574851,6000,9.9466724619268129E-2,1500,2.5710894531837711E-2,55100,4700,7.9155452281047825E-2,59800,null,0.19654813271834548,null,0.19840797500371965,null,0.17196101770569855,null,0.17776372563606607,null,0.25531914893617019,null,null,0]
["    Boisbriand",10400,0.36759926522537806,3100,0.10788469690546842,3000,0.10580048042956054,8300,0.29203758654797229,3600,0.12667797089162075,28400,0,0,28300,null,9.1734140048046975E-2,null,6.8111041907643027E-2,null,4.4621407598540802E-2,null,0.15455111664738855,null,0.64098229379838079,null,null,0.13509561737658241]
["    Bois-des-Filion",3100,0.30475440496111822,1200,0.12058273452111429,3200,0.31105423762181317,1700,0.16251599566886504,700,6.7526331331823994E-2,9900,300,3.3566295895265282E-2,10200,null,0.3201589714474094,null,0.2238237394919507,null,0.13221369571985861,null,0.20292668632442626,null,0.12087690701635501,null,null,3.9779821676661449E-2]
["    Lorraine",8100,0.85129446432330047,1400,0.14870553567669964,0,0,0,0,0,0,9500,0,0,9500,null,0.49049287897994182,null,8.8658563865483556E-2,null,0.14145104764745359,null,0.18343151144582806,null,9.5965998061292968E-2,null,null,3.9188995558102881E-2]
["    Rosemère",10700,0.75684882895670702,3400,0.24315117104329309,0,0,0,0,0,0,14100,0,0,14100,null,0.68316937553464496,null,0.19493156544054749,null,7.7202737382378095E-2,null,4.4696321642429426E-2,null,0,null,null,0]
["    Sainte-Anne-des-Plaines",500,3.3506339925103476E-2,800,5.203337494251363E-2,1300,8.2714670520990741E-2,5100,0.33729715524604165,5900,0.38880494054267134,13600,1600,0.10564351882267919,15200,null,5.524565543874705E-2,null,0.10469856254022741,null,0.16123149538725595,null,0.16949152542372878,null,0.50933276121004079,null,null,3.2586135325861354E-2]
["    Sainte-Thérèse",7300,0.27576979610296609,4700,0.17525345795801456,5000,0.18949986808879507,3900,0.14642143745524441,2500,9.2865488259902762E-2,23400,3200,0.12018995213507708,26500,null,0.45718852271862398,null,0.10929294466854403,null,0.36060582997183954,null,0,null,7.2912702640992463E-2,null,null,8.8898134664725056E-2]
["RLS de la Rivière-du-Nord - Mirabel-Nord",30700,0.16940872652123226,31300,0.17250627437330246,37200,0.20475156630898814,39300,0.21637938814619007,40200,0.22120265276358497,178600,2900,1.5751391886702104E-2,181500,{"$f":"B1151","v":30700},{"$f":"C1151/100","v":1.6940872652123225E-3},{"$f":"D1151","v":31300},{"$f":"E1151/100","v":1.7250627437330247E-3},{"$f":"F1151","v":37200},{"$f":"G1151/100","v":2.0475156630898814E-3},{"$f":"H1151","v":39300},{"$f":"I1151/100","v":2.1637938814619007E-3},{"$f":"J1151","v":40200},{"$f":"K1151/100","v":2.2120265276358497E-3},{"$f":"L1151","v":178600},{"$f":"M1151","v":2900},{"$f":"N1151/100","v":1.5751391886702104E-4},{"$f":"O1151","v":181500}]
["    Mirabel",2400,5.9402713740730702E-2,7100,0.17199768723488465,15900,0.38743121283727183,11000,0.26681451342086582,4700,0.11435387276624694,41100,0,0,41100,2400,5.9402713740730701E-4,7100,1.7199768723488466E-3,15900,3.8743121283727183E-3,11000,2.6681451342086583E-3,4700,1.1435387276624693E-3,41100,0,0,41100]
["    Prévost",5600,0.41221151037101955,3000,0.22056675430908559,0,0,2700,0.19872918492550398,2300,0.16849255039439087,13700,0,0,13700,5600,4.1221151037101958E-3,3000,2.2056675430908558E-3,0,0,2700,1.98729184925504E-3,2300,1.6849255039439086E-3,13700,0,0,13700]
["    Saint-Colomban",10800,0.60790544199070629,4600,0.2566162338648923,2400,0.13547832414440142,0,0,0,0,17700,0,0,17700,10800,6.0790544199070626E-3,4600,2.566162338648923E-3,2400,1.3547832414440141E-3,0,0,0,0,17700,0,0,17700]
["    Sainte-Sophie",3200,0.17505530973451328,4800,0.26332964601769909,8900,0.48949115044247793,1300,7.212389380530973E-2,0,0,18100,0,0,18100,3200,1.7505530973451328E-3,4800,2.6332964601769909E-3,8900,4.8949115044247789E-3,1300,7.2123893805309735E-4,0,0,18100,0,0,18100]
["    Saint-Hippolyte",1300,0.12287937013778234,3000,0.28400037491798669,3800,0.35589089886587311,2500,0.23722935607835788,0,0,10700,0,0,10700,1300,1.2287937013778234E-3,3000,2.8400037491798668E-3,3800,3.5589089886587312E-3,2500,2.3722935607835786E-3,0,0,10700,0,0,10700]
["    Saint-Jérôme",7400,9.2254372732599454E-2,8900,0.11065538005061523,6200,7.7119668881602738E-2,21800,0.27115305499108622,33100,0.4131749217707853,77400,2900,3.5642601573311061E-2,80200,7400,9.2254372732599452E-4,8900,1.1065538005061524E-3,6200,7.7119668881602736E-4,21800,2.7115305499108623E-3,33100,4.1317492177078531E-3,77400,2900,3.5642601573311063E-4,80200]
["RLS Argenteuil",1600,4.5154374431469302E-2,8800,0.25208930355320319,7600,0.2191526840635046,7900,0.22614600018004188,7500,0.21477826410583517,33264.464,1500,4.2679373665945805E-2,34700,null,7.9000000000000001E-2,null,0.33899999999999997,null,0.218,null,0.21600000000000003,null,0.13300000000000001,null,null,3.5000000000000003E-2]
["    Brownsburg-Chatham",0,0,700,0.10169725403615289,3100,0.42872912929488066,2800,0.3878846419207948,600,8.1688974748171661E-2,7247,0,0,7200,null,0.16986754966887418,null,0.20132450331125828,null,0.62880794701986753,null,0,null,0,null,null,0]
["    Gore",0,0,2300,1,0,0,0,0,0,0,2278.4639999999999,0,0,2300,null,0,null,0.23254225712822263,null,3.8586306983097146E-2,null,0.49009731944681578,null,0.23877411644186444,null,null,8.900000000000001E-2]
["    Grenville",0,0,0,0,0,0,0,0,1800,1,1816,0,0,1800,null,0.52993697478991597,null,0.47006302521008403,null,0,null,0,null,0,null,null,0]
["    Grenville-sur-la-Rouge",0,0,1800,0.627471383975026,500,0.17551161984044397,600,0.19701699618452997,0,0,2883,0,0,2900,null,0,null,1,null,0,null,0,null,0,null,null,0]
["    Harrington",0,0,0,0,1000,1,0,0,0,0,967,0,0,1000,null,0,null,1,null,0,null,0,null,0,null,null,0]
["    Lachute",0,0,1400,0.10184397163120568,1600,0.11680851063829788,4500,0.31765957446808513,5100,0.35851063829787239,12617,1500,0.105177304964539,14100,null,6.3886548722269024E-2,null,0.29752878404942434,null,0.54689693906206127,null,0,null,9.168772816624543E-2,null,null,0]
["    Mille-Isles",900,0.49447995351539803,900,0.50552004648460203,0,0,0,0,0,0,1721,0,0,1700,null,0.20538243626062322,null,0.60021246458923516,null,0.19440509915014165,null,0,null,0,null,null,0]
["    Saint-André-d'Argenteuil",700,0.23517851293809364,1600,0.53357353422862763,700,0.23124795283327873,0,0,0,0,3053,0,0,3100,null,0,null,0,null,0,null,0.58445353594389249,null,0.41554646405610751,null,null,0]
["    Wentworth",0,0,0,0,700,1,0,0,0,0,682,0,0,700,null,0,null,1,null,0,null,0,null,0,null,null,0]
["RLS Les Pays-d'en-Haut",200,3.7308659872937362E-3,8600,0.18276979490896686,12500,0.26695945081652667,16400,0.35001918731079179,9200,0.19630750863428986,46896,0,2.1319234213107061E-4,46900,null,8.9767044761556291E-3,null,9.4E-2,null,0.22699999999999998,null,0.441,null,0.23,null,null,0.21061680636148719]
["    Estérel",0,0,300,1,0,0,0,0,0,0,262,0,0,300,null,1,null,0,null,0,null,0,null,0,null,null,0]
["    Lac-des-Seize-îles",200,1,0,0,0,0,0,0,0,0,175,0,0,200,null,0,null,0.30439520523065744,null,0,null,0.69560479476934267,null,0,null,null,3.619254433586681E-3]
["    Morin-Heights",0,0,1100,0.22851646002565201,2700,0.57994869602394183,900,0.19153484395040615,0,0,4678,0,0,4700,null,0,null,5.4725597956498187E-2,null,0.1843795959439585,null,0.41736976546172305,null,0.34352504063782019,null,null,0]
["    Piedmont",0,0,0,0,800,0.23388952819332565,1300,0.38607594936708867,1300,0.3800345224395858,3476,0,0,3500,null,0,null,0,null,0,null,0.3976271186440678,null,0.60237288135593225,null,null,0]
["    Saint-Adolphe-d'Howard",0,0,0,0,2100,0.55857740585774063,1700,0.44142259414225937,0,0,3824,0,0,3800,null,0,null,0.16865134311824978,null,0.62918859041816666,null,0.20216006646358353,null,0,null,null,0]
["    Sainte-Adèle",0,0,1900,0.13283369022127053,1500,0.10628122769450393,5700,0.40927908636688082,4900,0.35160599571734474,14010,0,0,14000,null,0,null,0,null,0.27663211881611283,null,0.46212202158350252,null,0.26124585960038466,null,null,8.5231160199393988E-2]
["    Sainte-Anne-des-Lacs",0,0,600,0.16752977731745211,3200,0.832470222682548,0,0,0,0,3862,0,0,3900,null,0,null,0.23377563329312426,null,0.33486127864897469,null,0.43136308805790108,null,0,null,null,0]
["    Sainte-Marguerite-du-Lac-Masson",0,0,1800,0.53786753786753783,800,0.24383724383724384,700,0.21532521532521531,0,0,3357,0,2.9700029700029701E-3,3400,null,1,null,0,null,0,null,0,null,0,null,null,0]
["    Saint-Sauveur",0,0,2000,0.17089810017271156,600,5.2417962003454228E-2,6000,0.52098445595854925,3000,0.25569948186528496,11580,0,0,11600,null,0,null,0,null,0.48370745836350471,null,0.51629254163649529,null,0,null,null,0]
["    Wentworth-Nord",0,0,900,0.56459330143540665,700,0.4354066985645933,0,0,0,0,1672,0,0,1700,null,0,null,0.20632658877172982,null,0,null,0.58050726702764321,null,0.21316614420062696,null,null,0]
["RLS Les Laurentides",2200,4.2499556885991691E-2,11700,0.23122673651456366,11000,0.21751974319081474,12600,0.2486952754199736,11300,0.22199027118577308,48800,1900,3.8068416802883198E-2,50800,null,7.698227611940299E-2,null,0.1863106343283582,null,0.2804570895522388,null,0.2883162313432836,null,0.16793376865671644,null,null,6.6000000000000003E-2]
["    Amherst",1000,0.60185185185185186,0,0,0,0,700,0.39814814814814814,0,0,1700,0,0,1700,null,0,null,0,null,0.3073170731707317,null,0.69268292682926824,null,0,null,null,0]
["    Arundel",0,0,0,0,0,0,0,0,600,1,600,0,0,600,null,0,null,0,null,0.18954647142566608,null,0.36099247508643484,null,0.44946105348789911,null,null,0]
["    Barkmere",0,0,0,0,0,0,0,0,0,0,0,100,1,100,null,0,null,0,null,1,null,0,null,0,null,null,0]
["    Brébeuf",0,0,600,0.554013875123885,0,0,500,0.445986124876115,0,0,1100,0,0,1000,null,0,null,0.48168789808917195,null,0.51831210191082799,null,0,null,0,null,null,0]
["    Huberdeau",0,0,0,0,0,0,900,1,0,0,900,0,0,900,null,8.9287742814949458E-2,null,5.3504487106668192E-2,null,0.17789389980688403,null,0.48710666818130188,null,0.19220720209019648,null,null,0.13890247481169912]
["    Ivry-sur-le-Lac",0,0,400,1,0,0,0,0,0,0,400,0,0,400,null,0,null,1,null,0,null,0,null,0,null,null,0]
["    La Conception",0,0,600,0.37851997380484614,900,0.62148002619515386,0,0,0,0,1500,0,0,1500,null,0.21491854815661618,null,0.3669619891397542,null,0.27150614461274653,null,0,null,0.1466133180908831,null,null,0]
["    La Minerve",0,0,1400,1,0,0,0,0,0,0,1400,0,0,1400,null,0,null,0,null,0,null,0,null,1,null,null,0]
["    Labelle",0,0,800,0.27233273056057866,1500,0.54575045207956596,500,0.18191681735985538,0,0,2800,0,0,2800,null,1,null,0,null,0,null,0,null,0,null,null,0]
["    Lac-Supérieur",0,0,700,0.3356997971602434,1300,0.66430020283975655,0,0,0,0,2000,0,0,2000,null,0,null,0,null,0,null,0,null,1,null,null,0]
["    Lac-Tremblant-Nord",0,0,0,0,0,0,0,0,0,0,0,100,1,100,null,0,null,0,null,0.54608294930875578,null,0.45391705069124422,null,0,null,null,0]
["    Lantier",0,0,900,1,0,0,0,0,0,0,900,0,0,900,null,0,null,0.56132075471698117,null,0,null,0.43867924528301894,null,0,null,null,0]
["    Montcalm",0,0,0,0,600,1,0,0,0,0,600,0,0,600,null,0.58401639344262291,null,0.41598360655737709,null,0,null,0,null,0,null,null,0]
["    Mont-Tremblant",600,5.5585880640465796E-2,1700,0.15574963609898107,300,3.1204512372634642E-2,4200,0.37991266375545846,3000,0.27174308588064044,9800,1200,0.1058042212518195,11000,null,0,null,0.6652542372881356,null,0.3347457627118644,null,0,null,0,null,null,0]
["    Sainte-Agathe-des-Monts",500,4.5223441263045221E-2,1800,0.16100258674516099,1700,0.15127999286415128,2700,0.2411916867362412,3900,0.34519668183034519,10600,600,5.6105610561056105E-2,11200,null,0,null,1,null,0,null,0,null,0,null,null,0]
["    Sainte-Lucie-des-Laurentides",0,0,1400,1,0,0,0,0,0,0,1400,0,0,1400,null,0,null,6.7503729487817007E-2,null,0.38736946792640475,null,0.27598209845847838,null,0.26914470412729985,null,null,0.16607920381505287]
["    Mont-Blanc",0,0,1500,0.40317460317460319,1700,0.44761904761904764,0,0,600,0.1492063492063492,3800,0,0,3800,null,0,null,0.58189977561705308,null,0.41810022438294697,null,0,null,0,null,null,0]
["    Val-David",0,0,0,0,1100,0.19773299748110829,1900,0.34202950701691248,2600,0.46023749550197912,5600,0,0,5600,null,0,null,0,null,0.57731126362535323,null,0.42268873637464677,null,0,null,null,0]
["    Val-des-Lacs",0,0,0,0,800,1,0,0,0,0,800,0,0,800,null,1,null,0,null,0,null,0,null,0,null,null,0]
["    Val-Morin",0,0,0,0,1100,0.34101825168107586,1300,0.43003522254242715,700,0.22894652577649699,3100,0,0,3100,null,0.43402489626556018,null,0.56597510373443982,null,0,null,0,null,0,null,null,0]
["RLS Antoine-Labelle",9100,0.24842301574241676,9600,0.26419285831824912,9800,0.26781306565739676,3000,8.1646645823048647E-2,2400,6.6013932313093077E-2,33840,2600,7.1910482145795623E-2,36500,null,0.39862479093105369,null,0.2790683268289661,null,0.13368023291829276,null,0.123149352660596,null,6.5477296661091491E-2,null,null,8.3903186448372746E-2]
["    Chute-Saint-Philippe",600,0.55052935514918189,0,0,500,0.44947064485081811,0,0,0,0,1039,0,0,1000,null,0.2952503209242619,null,0.70474967907573816,null,0,null,0,null,0,null,null,0]
["    Ferme-Neuve",1500,0.55265095729013258,400,0.14101620029455081,400,0.14653902798232696,400,0.15979381443298968,0,0,2716,0,0,2700,null,1,null,0,null,0,null,0,null,0,null,null,0]
["    Kiamika",0,0,800,1,0,0,0,0,0,0,790,0,0,800,null,0,null,1,null,0,null,0,null,0,null,null,0]
["    La Macaza",0,0,0,0,500,0.41590493601462525,0,0,0,0,455,600,0.58409506398537481,1100,null,1,null,0,null,0,null,0,null,0,null,null,0]
["    Lac-des-Écorces",500,0.18162911611785096,800,0.29081455805892548,1000,0.34107452339688044,500,0.18648180242634316,0,0,2885,0,0,2900,null,1,null,0,null,0,null,0,null,0,null,null,0]
["    Lac-du-Cerf",0,0,400,1,0,0,0,0,0,0,445,0,0,400,null,0.65980346279831537,null,0.16612072999532054,null,0.17407580720636406,null,0,null,0,null,null,0]
["    Lac-Saguay",0,0,0,0,500,1,0,0,0,0,526,0,0,500,null,8.3294770939379911E-2,null,0.52707080055529842,null,0.1036557149467839,null,0.19134659879685331,null,9.4632114761684386E-2,null,null,0]
["    Lac-Saint-Paul",500,1,0,0,0,0,0,0,0,0,525,0,0,500,null,0,null,0,null,0,null,1,null,0,null,null,0.61826086956521742]
["    L'Ascension",0,0,900,1,0,0,0,0,0,0,899,0,0,900,null,1,null,0,null,0,null,0,null,0,null,null,0]
["    Mont-Laurier",2600,0.18124118476727782,2900,0.20465444287729195,3500,0.24576868829337095,1700,0.11798307475317349,1600,0.11086036671368124,12202,2000,0.13949224259520451,14200,null,0,null,0,null,1,null,0,null,0,null,null,0]
["    Mont-Saint-Michel",600,1,0,0,0,0,0,0,0,0,581,0,0,600,null,0.5286624203821656,null,0.4713375796178344,null,0,null,0,null,0,null,null,0]
["    Nominingue",400,0.1574279379157428,1100,0.4860310421286031,500,0.2093126385809313,300,0.14722838137472283,0,0,2255,0,0,2300,null,0.1869056327724945,null,0.43708851499634238,null,0.21141185076810534,null,0.16459400146305783,null,0,null,null,0]
["    Notre-Dame-de-Pontmain",800,1,0,0,0,0,0,0,0,0,790,0,0,800,null,0.27545263157894739,null,0.22147368421052632,null,0.16917894736842104,null,0.19031578947368424,null,0.14357894736842106,null,null,0.15875602153584584]
["    Notre-Dame-du-Laus",0,0,1700,1,0,0,0,0,0,0,1730,0,0,1700,null,0.83370288248337032,null,0,null,0.16629711751662971,null,0,null,0,null,null,0]
["    Rivière-Rouge",800,0.17814726840855108,500,0.11854890952278126,2400,0.52299719283092205,0,0,800,0.18030662923774565,4631,0,0,4600,null,1,null,0,null,0,null,0,null,0,null,null,0]
["    Saint-Aimé-du-Lac-des-îles",800,1,0,0,0,0,0,0,0,0,815,0,0,800,null,1,null,0,null,0,null,0,null,0,null,null,0]
["    Sainte-Anne-du-Lac",0,0,0,0,600,0.9910873440285205,0,0,0,0,556,0,8.9126559714795012E-3,600,null,0,null,1,null,0,null,0,null,0,null,null,0]
["   Territoires non organisés","ND","ND","ND","ND","ND","ND","ND","ND","ND","ND","ND","ND","ND","ND",null,0,null,0,null,0,null,0,null,0,null,null,1]

{"sheet":"Donnees_RLS_OLD","index":3,"n_rows":274,"n_cols":15,"rows_kept":274,"cut":false,"hidden":false,"merged":[[3,1,3,2],[3,9,3,10],[3,11,5,11],[3,12,5,13],[3,14,5,14],[4,1,4,2],[4,3,4,4],[4,5,4,6],[4,7,4,8],[2,0,2,14],[94,0,94,14],[95,1,95,2],[95,9,95,10],[95,11,96,11],[95,12,96,13],[95,14,96,14],[96,1,96,2],[96,3,96,4],[96,5,96,6],[4,9,4,10],[5,1,5,2],[5,3,5,4],[5,5,5,6],[5,7,5,8],[5,9,5,10],[187,5,187,6],[187,7,187,8],[187,9,187,10],[96,7,96,8],[96,9,96,10],[185,0,185,14],[186,1,186,2],[186,9,186,10],[186,11,187,11],[186,12,187,13],[186,14,187,14],[187,1,187,2],[187,3,187,4]]}
["Défavorisation combinée 2016 RLS"]
[]
["Répartition de la population (N, %) par profil de défavorisation combinée 2016\nRégion des Laurentides (variation régionale 2016)"]
[null,"Conditions\nplus favorables",null,null,null,null,null,null,null,"Conditions\nplus défavorables",null,"Population\navec indice","Population\nsans indice",null,"Population\ntotale"]
[null,"Profil 1",null,"Profil 2",null,"Profil 3",null,"Profil 4",null,"Profil 5"]
[null,"matériellement \nET socialement \nplus favorables",null,"moyennes matériellement\nEt socialement",null,"socialement\nplus défavorables\n(pas matériellement)",null,"matériellement\nplus défavorables\n(pas socialement)",null,"matériellement\nET socialement\nplus défavorables"]
[null,"N","%","N","%","N","%","N","%","N","%","N","N","%","N"]
["1511 - RLS d'Antoine-Labelle",0,0,2490,7.6968345412872452,540,1.6663569348943814,23710,73.440500526544014,5550,17.19630799727436,32290,2960,8.390318644837274,35240]
["    Notre-Dame-du-Laus",0,0,0,0,0,0,1560,100,0,0,1560,0,0,1560]
["    Notre-Dame-de-Pontmain",0,0,0,0,0,0,780,100,0,0,780,0,0,780]
["    Lac-du-Cerf",0,0,0,0,0,0,440,100,0,0,440,0,0,440]
["    Saint-Aimé-du-lac-des-îles",0,0,0,0,0,0,790,100,0,0,790,0,0,790]
["    Kiamika",0,0,0,0,0,0,760,100,0,0,760,0,0,760]
["    Nominingue",0,0,610,28.685072531586336,0,0,1520,71.314927468413671,0,0,2140,0,0,2140]
["    Rivière-Rouge",0,0,720,16.728366496992134,0,0,2360,54.673762147154093,1240,28.597871355853773,4320,0,0,4320]
["    La Macaza",0,0,0,0,0,0,0,0,440,100,440,710,61.826086956521742,1150]
["    L'Ascension",0,0,0,0,0,0,790,100,0,0,790,0,0,790]
["    Lac-Saguay",0,0,0,0,0,0,460,100,0,0,460,0,0,460]
["    Chute-Saint-Philippe",0,0,0,0,0,0,940,100,0,0,940,0,0,940]
["    Lac-des-Écorces",0,0,690,25.164594001463058,0,0,1600,58.37600585223116,450,16.459400146305782,2730,0,0,2730]
["    Mont-Laurier",0,0,460,3.8821052631578952,540,4.5305263157894737,7450,62.728421052631575,3430,28.858947368421049,11880,2240,15.875602153584584,14120]
["    Ferme-Neuve",0,0,0,0,0,0,2710,100,0,0,2710,0,0,2710]
["    Lac-Saint-Paul",0,0,0,0,0,0,480,100,0,0,480,0,0,480]
["   Mont-Saint-Michel",0,0,0,0,0,0,500,100,0,0,500,0,0,500]
["   Sainte-Anne-du-Lac",0,0,0,0,0,0,580,100,0,0,580,0,100,580]
["   Territoires non organisés",0,0,0,0,0,0,0,0,0,0,0,10,0,10]
["1512 - RLS des Laurentides",550,1.2873134328358209,9300,21.686100746268657,7370,17.175839552238806,13470,31.401585820895523,12200,28.449160447761194,42880,3020,6.5835911289268436,45900]
["    Val-Morin",0,0,880,30.73170731707317,630,22.05574912891986,0,0,1360,47.21254355400697,2870,0,0,2870]
["    Val-David",0,0,930,18.954647142566607,2870,58.389261744966447,0,0,1110,22.65609111246695,4920,0,0,4920]
["    Lanthier",0,0,0,0,0,0,830,100,0,0,830,0,0,830]
["    Sainte-Lucie-des-Laurentides",0,0,0,0,0,0,1260,100,0,0,1260,0,0,1260]
["    Sainte-Agathe-des-Monts",0,0,480,5.4413268204021357,1980,22.43553334090651,2340,26.627286152448026,4010,45.495853686243329,8800,1420,13.890247481169911,10220]
["    Ivry-sur-le-Lac",0,0,390,100,0,0,0,0,0,0,390,0,0,390]
["    St-Faustin-Lac-Carré",0,0,490,13.918262360674477,0,0,2500,71.420405830237215,510,14.66133180908831,3500,0,0,3500]
["    Barkmere",0,0,0,0,60,100,0,0,0,0,60,0,0,60]
["    Montcalm",0,0,0,0,0,0,630,100,0,0,630,0,0,630]
["    Arundel",0,0,0,0,560,100,0,0,0,0,560,0,0,560]
["    Huberdeau",0,0,0,0,0,0,470,54.60829493087558,390,45.39170506912442,870,0,0,870]
["    Amherst",0,0,0,0,0,0,830,56.132075471698116,650,43.867924528301891,1480,0,0,1480]
["    Brébeuf",0,0,410,41.598360655737707,0,0,570,58.401639344262293,0,0,980,0,0,980]
["    Lac-Supérieur",510,27.012711864406779,1380,72.987288135593218,0,0,0,0,0,0,1890,0,0,1890]
["    Val-des-Lacs",0,0,0,0,0,0,740,100,0,0,740,0,0,740]
["    Mont-Tremblant",0,0,2380,29.624564893088017,1270,15.726006961710592,1280,15.862754848334163,3120,38.786673296867228,8040,1600,16.607920381505288,9650]
["    La Conception",0,0,1340,100,0,0,0,0,0,0,1340,0,0,1340]
["    Labelle",0,0,630,25.353249899071457,0,0,800,32.37787646346387,1050,42.268873637464679,2480,0,0,2480]
["    Lac-Tremblant-Nord",40,100,0,0,0,0,0,0,0,0,40,0,0,40]
["    La Minerve",0,0,0,0,0,0,1210,100,0,0,1210,0,0,1210]
["1513- RLS des Pays-d'en-Haut",2500,6.0934260275643375,10180,24.82253933406513,21690,52.908891328210764,840,2.0490303695572631,5790,14.126112940602512,41000,880,2.1061680636148719,532260]
["    Estérel",200,100,0,0,0,0,0,0,0,0,200,0,0,200]
["    Sainte-Marguerite-du-Lac-Masson",0,0,840,30.439520523065745,640,23.102070468579729,0,0,1280,46.458409008354522,2750,10,0.36192544335866811,2760]
["    Sainte-Adèle",0,0,3090,23.910519390045671,6070,46.954098614443836,0,0,3760,29.135381995510489,12920,0,0,12920]
["    Piedmont",0,0,0,0,2950,100,0,0,0,0,2950,0,0,2950]
["    Sainte-Anne-des-Lacs",610,16.865134311824978,2270,62.918859041816667,730,20.216006646358352,0,0,0,0,3610,0,0,3610]
["    Saint-Sauveur",0,0,2590,27.663211881611282,6770,72.336788118388711,0,0,0,0,9360,870,8.5231160199393994,10230]
["    Morin-Heights",970,23.377563329312427,1390,33.486127864897469,1790,43.136308805790108,0,0,0,0,4150,0,0,4150]
["    Lac-des-Seize-îles",0,0,0,0,0,0,170,100,0,0,170,0,0,170]
["    Wentworth-Nord",0,0,0,0,710,51.629254163649527,670,48.370745836350473,0,0,1380,0,0,1380]
["    Saint-Adolphe-d'Howard",720,20.632658877172982,0,0,2040,58.050726702764322,0,0,750,21.316614420062695,3510,0,0,3510]
["1514 - RLS d'Argenteuil",530,1.7060913543100413,2390,7.6406004929419682,710,2.2758554463685541,17420,55.756857975096828,10190,32.620594731282608,31240,1150,3.5444132267127726,457990]
["    Saint-André-d'Argenteuil",0,0,0,0,0,0,3020,100,0,0,3020,0,0,3020]
["    Lachute",0,0,0,0,0,0,3180,27.112856411131979,8540,72.887143588868014,11710,1150,8.9255170269009483,12860]
["    Gore",0,0,900,47.006302521008401,0,0,1010,52.993697478991599,0,0,1900,0,0,1900]
["    Mille-Isles",0,0,820,52.201659221442242,0,0,750,47.798340778557751,0,0,1570,0,0,1570]
["    Wentworth",530,100,0,0,0,0,0,0,0,0,530,0,0,530]
["    Brownsburg-Chatham",0,0,670,9.4636338107273232,0,0,5800,81.36759337264813,650,9.1687728166245428,7120,0,0,7120]
["    Grenville-sur-la-Rouge",0,0,0,0,0,0,2820,100,0,0,2820,0,0,2820]
["    Grenville",0,0,0,0,710,41.554646405610754,0,0,1000,58.445353594389246,1710,0,0,1710]
["    Harrington",0,0,0,0,0,0,850,100,0,0,850,0,0,850]
["1515 - RLS de Deux-Montagnes - Mirabel-Sud",13300,11.6,41700,36.4,23820,20.8,20770,18.100000000000001,14970,13.1,114560,810,0.68916045397484182,115370]
["    Saint-Eustache",5910,13.667083275470999,14360,33.229181132250154,9040,20.92764893764755,4570,10.579549136693977,9330,21.596537517937321,43210,800,1.8223959280130886,44010]
["    Deux-Montagnes",3070,17.529721079103794,3720,21.244855967078188,8760,50.085733882030183,1500,8.5619570187471421,450,2.5777320530406951,17500,0,0,17500]
["    Sainte-Marthe-sur-le-Lac",3870,21.411972999889343,8510,47.100807790195859,380,2.1245988713068495,4470,24.742724355427686,840,4.6198959831802586,18070,0,0,18070]
["    Pointe-Calumet",0,0,0,0,470,7.2650902302426879,3850,59.878655880522714,2110,32.856253889234601,6430,0,0,6430]
["    Saint-Joseph-du-Lac",0,0,5290,79.138627187079408,0,0,1400,20.861372812920592,0,0,6690,0,0,6690]
["    Oka",450,11.861743912018854,1600,41.76485991097146,0,0,1770,46.373396177009688,0,0,3820,10,0.1307531380753138,3820]
["    Saint-Placide",0,0,0,0,660,39.383155397390276,470,27.876631079478052,550,32.740213523131672,1690,0,0,1690]
["    Mirabel",0,0,8230,47.9,4500,26.2,2740,14.50571549534293,1690,16.871295512277733,17170,0,0,17170]
["1516 - RLS de la Rivière-du-Nord - Mirabel-Nord",15270,9.6238212898996522,35560,23,34850,22.5,38250,24.109979325298774,30790,19.899999999999999,154710,6810,4.1129505055816455,161520]
["    Mirabel",5900,15.822224606388971,11650,32.556392994126007,7400,22.2,3490,9.3635168843708918,4910,14.8459083228281,33350,0,0,33350]
["    Saint-Colomban",1090,6.8044197515450406,7210,44.977838816405516,2600,16.224483425931709,5130,31.993258006117735,0,0,16020,0,0,16020]
["    Saint-Jérôme",3490,5.1716735020209947,8920,13.205312328807686,16170,23.943974770879912,13770,20.3846552464429,25190,37.294384151848512,67540,6810,9.1531487907890128,74350]
["    Sainte-Sophie",0,0,0,0,2590,16.507329509241554,13100,83.492670490758442,0,0,15690,0,0,15690]
["    Prévost",4790,36.809721581295186,4100,31.502845716043687,2840,21.873557914167051,590,4.5531456698969386,680,5.2607291185971388,13000,0,0,13000]
["    Saint-Hippolyte",0,0,3690,40.502578733677161,3250,35.641391418852194,2170,23.856029847470648,0,0,9110,0,0,9110]
["1517 - RLS de Thérèse-De Blainville",50110,33.586706616528247,21540,14.438255343964288,44600,29.896706817618156,18880,12.657939364689952,14050,9.4203918571993537,149190,7920,5.0387325512561825,195910]
["    Boisbriand",5920,22.005653920547537,6830,25.412884987353074,7430,27.629816991519117,2490,9.2731736348757625,4220,15.678470465704509,26880,0,0,26880]
["    Sainte-Thérèse",3230,14.351810659311326,1000,4.4621407598540799,9870,43.914049292641693,370,1.6327075362576742,8010,35.639291751935225,22480,3510,13.50956173765824,25990]
["    Blainville",23510,43.06148239043241,7780,14.254317686489259,16410,30.061720481309866,5630,10.303840589000202,1270,2.3186388527682644,54600,2260,3.9779821676661449,56860]
["    Rosemère",7770,57.915144284542542,1900,14.145104764745358,3750,27.939750950712099,0,0,0,0,13410,550,3.9188995558102881,13960]
["    Lorraine",7790,83.329769033361842,1140,12.200598802395209,420,4.4696321642429426,0,0,0,0,9350,0,0,9350]
["    Bois-des-Filion",1030,11.03840377601373,1050,11.306586569405706,5770,61.853679467925339,910,9.7725809912036041,560,6.0287491954516197,9320,310,3.2586135325861356,9640]
["    Sainte-Anne-des-Plaines",860,6.5758429104193619,1830,13.928000608874344,960,7.2912702640992464,9490,72.204886216607051,0,0,13140,1280,8.8898134664725053,14420]
[]
["Défavorisation matérielle 2016 RLS"]
["Répartition de la population (N, %) par quintile de défavorisation matérielle 2016\nRégion des Laurentides (variation régionale 2016)"]
[null,"Conditions\nplus favorables",null,null,null,null,null,null,null,"Conditions\nplus défavorables",null,"Population avec indice","Population\nsans indice",null,"Population totale"]
[null,"Quintile 1",null,"Quintile 2",null,"Quintile 3",null,"Quintile 4",null,"Quintile 5"]
[null,"N","%","N","%","N","%",null,null,null,null,"N","N","%","N"]
["1511 - RLS d'Antoine-Labelle",0,0,538,1.6663569348943814,2485,7.6968345412872452,4796,14.854735798798242,24467,75.782072725020129,32286,2957,8.390318644837274,35243]
["    Notre-Dame-du-Laus",0,0,0,0,0,0,0,0,1558,100,1558,0,0,1558]
["    Notre-Dame-de-Pontmain",0,0,0,0,0,0,0,0,782,100,782,0,0,782]
["    Lac-du-Cerf",0,0,0,0,0,0,0,0,435,100,435,0,0,435]
["    Saint-Aimé-du-Lac-des-îles",0,0,0,0,0,0,0,0,790,100,790,0,0,790]
["    Kiamika",0,0,0,0,0,0,0,0,757,100,757,0,0,757]
["    Nominingue",0,0,0,0,613,28.685072531586336,355,16.612072999532053,1169,54.702854468881611,2137,0,0,2137]
["    Rivière-Rouge",0,0,0,0,723,16.728366496992134,547,12.656177695511337,3052,70.615455807496531,4322,0,0,4322]
["    La Macaza",0,0,0,0,0,0,439,100,0,0,439,711,61.8,1150]
["    L'Ascension",0,0,0,0,0,0,0,0,791,100,791,0,0,791]
["    Lac-Saguay",0,0,0,0,0,0,0,0,459,100,459,0,0,459]
["    Chute-Saint-Philippe",0,0,0,0,0,0,444,47.133757961783438,498,52.866242038216562,942,0,0,942]
["    Lac-des-Écorces",0,0,0,0,688,25.164594001463058,0,0,2046,74.835405998536942,2734,0,0,2734]
["    Mont-Laurier",0,0,538,4.5305263157894737,461,3.8821052631578952,3011,25.355789473684208,7865,66.231578947368419,11875,2241,15.9,14116]
["    Ferme-Neuve",0,0,0,0,0,0,0,0,2706,100,2706,0,0,2706]
["    Lac-Saint-Paul",0,0,0,0,0,0,0,0,481,100,481,0,0,481]
["   Mont-Saint-Michel",0,0,0,0,0,0,0,0,503,100,503,0,0,503]
["   Sainte-Anne-du-Lac",0,0,0,0,0,0,0,0,575,100,575,0,0,575]
["   Territoires non organisés",0,0,0,0,0,0,0,0,0,0,0,5,100,5]
["1512 - RLS des Laurentides",4603,10.734608208955224,3602,8.4001865671641784,9011,21.01445895522388,11110,25.909514925373134,14554,33.941231343283583,42880,3022,6.5835911289268436,45902]
["    Val-Morin",0,0,0,0,1515,52.78745644599303,1355,47.21254355400697,0,0,2870,0,0,2870]
["    Val-David",692,14.073622127313405,1106,22.493390278625178,2005,40.776896481594463,1114,22.65609111246695,0,0,4917,0,0,4917]
["    Lantier",0,0,0,0,0,0,0,0,834,100,834,0,0,834]
["    Sainte-Lucie-des-Laurentides",0,0,0,0,0,0,0,0,1256,100,1256,0,0,1256]
["    Sainte-Agathe-des-Monts",1329,15.097125979779621,0,0,1125,12.779734181529022,1677,19.050323753265932,4672,53.072816085425423,8803,1420,13.890247481169911,10223]
["    Ivry-sur-le-Lac",0,0,0,0,387,100,0,0,0,0,387,0,0,387]
["    St-Faustin—Lac-Carré",487,13.918262360674477,0,0,0,0,2549,72.849385538725357,463,13.232352100600172,3499,0,0,3499]
["    Barkmere",0,0,0,0,58,100,0,0,0,0,58,0,0,58]
["    Montcalm",0,0,0,0,0,0,0,0,628,100,628,0,0,628]
["    Arundel",563,100,0,0,0,0,0,0,0,0,563,0,0,563]
["    Huberdeau",0,0,0,0,0,0,868,100,0,0,868,0,0,868]
["    Amherst",0,0,0,0,0,0,0,0,1484,100,1484,0,0,1484]
["    Brébeuf",0,0,0,0,406,41.598360655737707,0,0,570,58.401639344262293,976,0,0,976]
["    Lac-Supérieur",0,0,510,27.012711864406779,1378,72.987288135593218,0,0,0,0,1888,0,0,1888]
["    Val-des-Lacs",0,0,0,0,0,0,0,0,744,100,744,0,0,744]
["    Mont-Tremblant",1532,19.045251118846345,1385,17.217802088513178,731,9.0875186474390865,2745,34.124813525609149,1651,20.524614619592242,8044,1602,16.607920381505288,9646]
["    La Conception",0,0,559,41.810022438294695,778,58.189977561705305,0,0,0,0,1337,0,0,1337]
["    Labelle",0,0,0,0,628,25.353249899071457,802,32.37787646346387,1047,42.268873637464679,2477,0,0,2477]
["    Lac-Tremblant-Nord",0,0,42,100,0,0,0,0,0,0,42,0,0,42]
["    La Minerve",0,0,0,0,0,0,0,0,1205,100,1205,0,0,1205]
["1513 - RLS des Pays-d'en-Haut",17540,42.785705573850471,9238,22.534455421392853,7586,18.504695694596901,3966,9.6743505305525055,2665,6.5007927796072691,40995,882,2.1061680636148719,41877]
["    Estérel",0,0,196,100,0,0,0,0,0,0,196,0,0,196]
["    Sainte-Marguerite-du-Lac-Masson",0,0,0,0,1474,53.541590991645485,0,0,1279,46.458409008354522,2753,10,0.36192544335866811,2763]
["    Sainte-Adèle",1824,14.118739840544933,4548,35.203963155042963,2783,21.541915008901618,3218,24.909048687978945,546,4.2263333075315428,12919,0,0,12919]
["    Piedmont",2950,100,0,0,0,0,0,0,0,0,2950,0,0,2950]
["    Sainte-Anne-des-Lacs",2873,79.562448075325392,738,20.437551924674604,0,0,0,0,0,0,3611,0,0,3611]
["    Saint-Sauveur",6586,70.370766107490113,2192,23.42130569505289,581,6.2079281974569929,0,0,0,0,9359,872,8.5231160199393994,10231]
["    Morin-Heights",1906,45.983112183353434,851,20.530759951749094,1388,33.486127864897469,0,0,0,0,4145,0,0,4145]
["    Lac-des-Seize-îles",0,0,0,0,0,0,0,0,172,100,172,0,0,172]
["    Wentworth-Nord",0,0,713,51.629254163649527,0,0,0,0,668,48.370745836350473,1381,0,0,1381]
["    Saint-Adolphe-d'Howard",1401,39.92590481618695,0,0,1360,38.757480763750358,748,21.316614420062695,0,0,3509,0,0,3509]
["1514 - RLS d'Argenteuil",0,0,533,1.7060913543100413,3098,9.9164559393105218,10445,33.433628885118914,17165,54.943823821260516,31241,1148,3.5444132267127726,32389]
["    Saint-André-d'Argenteuil",0,0,0,0,0,0,1372,45.430463576158942,1648,54.569536423841058,3020,0,0,3020]
["    Lachute",0,0,0,0,0,0,3740,31.927607990438787,7974,68.072392009561213,11714,1148,8.9255170269009483,12862]
["    Gore",0,0,0,0,895,47.006302521008401,0,0,1009,52.993697478991599,1904,0,0,1904]
["    Mille-Isles",0,0,0,0,818,52.201659221442242,749,47.798340778557751,0,0,1567,0,0,1567]
["    Wentworth",0,0,533,100,0,0,0,0,0,0,533,0,0,533]
["    Brownsburg-Chatham",0,0,0,0,674,9.4636338107273232,2574,36.141533277169337,3874,54.39483291210334,7122,0,0,7122]
["    Grenville-sur-la-Rouge",0,0,0,0,0,0,1164,41.218130311614729,1660,58.781869688385271,2824,0,0,2824]
["    Grenville",0,0,0,0,711,41.554646405610754,0,0,1000,58.445353594389246,1711,0,0,1711]
["    Harrington",0,0,0,0,0,0,846,100,0,0,846,0,0,846]
["1515 - RLS de Deux-Montagnes—Mirabel-Sud",14346,12.522542715479082,28323.4,24.723336564031804,36152.012000000002,31.55688794928987,20503.986000000001,17.897814061242514,15236,13.299418709956734,114561.398,807,0.6994983149544991,115368.398]
["    Saint-Eustache",7287,16.865713095403418,8319,19.254270240244413,13698,31.703930009720871,6800,15.738554830347637,7102,16.437531824283663,43206,802,1.8223959280130886,44008]
["    Deux-Montagnes",4625,26.434613625971647,6196,35.413808870598999,4726,27.011888431641516,1453,8.3047553726566061,496,2.8349336991312297,17496,0,0,17496]
["    Sainte-Marthe-sur-le-Lac",0,0,9509,52.611486112647995,3258,18.025893548744051,3535,19.558481797056544,1772,9.8041385415513993,18074,0,0,18074]
["    Pointe-Calumet",0,0,0,0,467,7.2650902302426879,1508,23.459863098942126,4453,69.275046670815186,6428,0,0,6428]
["    Saint-Joseph-du-Lac",0,0,1480,22.132495887542994,3812,57.006131299536413,1395,20.861372812920592,0,0,6687,0,0,6687]
["    Oka",453,11.861743912018854,0,0,1595,41.76485991097146,1771,46.373396177009688,0,0,3819,5,0.1307531380753138,3824]
["    Saint-Placide",0,0,0,0,664,39.383155397390276,0,0,1022,60.616844602609731,1686,0,0,1686]
["    Mirabel",1981,10.483700254022017,2819.4,16.42490316857203,7932.0120000000006,46.209310148241244,4041.9859999999999,23.547289727858335,391,2.27783824179317,17165.398000000001,0,0,17165.398000000001]
["1516 - RLS de la Rivière-du-Nord—Mirabel-Nord",18064,11.7,31669.599999999999,20.5,35944,23.2,44486,28.8,24549,15.9,154713,6805,4.2,161518]
["    Mirabel",5945,17.8,11068.6,33.200000000000003,7930.9880000000003,23.8,7544.0140000000001,22.6,859,2.6,33347.601999999999,0,0,33347.601999999999]
["    Saint-Colomban",0,0,3689,23,7205,45,5125,32,null,0,16019,0,0,16019]
["    Saint-Jérôme",6600,9.7718422883877949,9116,13.5,12868,19.100000000000001,19811,29.3,19146,28.3,67541,6805,9.1531487907890128,74346]
["    Sainte-Sophie",0,0,1507,9.6,1083,6.9,9240,58.9,3860,24.6,15690,0,0,15690]
["    Prévost",4664,35.871404399323183,3896,30,3166,24.4,592,4.5999999999999996,684,5.3,13002,0,0,13002]
["    Saint-Hippolyte",855,9.3822012509601667,2393,26.3,3691,40.5,2174,23.9,null,0,9113,0,0,9113]
["1517 - RLS de Thérèse-De Blainville",58220,39,39201,26.3,18828,12.6,17954,12,14984,10,149187,7916,5.0387325512561825,157103]
["    Boisbriand",8879,33.027079303675052,6285,23.378217527153698,5012,18.643059068590983,2378,8.8454099092396952,4330,16.106234191340572,26884,0,0,26884]
["    Sainte-Thérèse",5846,26.007651926327963,5424,24.130260699350476,2830,12.590088086128659,5279,23.485185514725508,3099,13.78681377346739,22478,3511,13.50956173765824,25989]
["    Blainville",21700,39.742861852347026,19715,36.107397300415741,6294,11.527261405468764,4800,8.7910477830076363,2092,3.8314316587608284,54601,2262,3.9779821676661449,56863]
["    Rosemère",11181,83.371858921780628,2230,16.628141078219372,0,0,0,0,0,0,13411,547,3.9188995558102881,13958]
["    Lorraine",7543,80.656544054747641,1390,14.863130881094952,419,4.4803250641574,0,0,0,0,9352,0,0,9352]
["    Bois-des-Filion",3071,32.943574340270324,3293,35.325037545591073,1485,15.930057927483373,1473,15.801330186655225,0,0,9322,314,3.2586135325861356,9636]
["    Sainte-Anne-des-Plaines",0,0,864,6.5758429104193619,2788,21.219270872973588,4024,30.626379480934624,5463,41.578506735672427,13139,1282,8.8898134664725053,14421]
[]
["Défavorisation sociale 2016 RLS"]
["Répartition de la population (N, %) par quintile de défavorisation sociale 2016\nRégion des Laurentides (variation régionale 2016)"]
[null,"Conditions\nplus favorables",null,null,null,null,null,null,null,"Conditions\nplus défavorables",null,"Population avec indice","Population\nsans indice",null,"Population totale"]
[null,"Quintile 1",null,"Quintile 2",null,"Quintile 3",null,"Quintile 4",null,"Quintile 5"]
[null,"N","%","N","%","N","%",null,null,null,null,"N","N","%","N"]
["1511 - RLS d'Antoine-Labelle",12900,39.93808049535604,9000,27.86377708978328,4300,13.312693498452013,4000,12.383900928792571,2100,6.5015479876160995,32300,3000,8.5227272727272716,35200]
["    Notre-Dame-du-Laus",500,31.25,1100,68.75,0,0,0,0,0,0,1600,0,0,1600]
["    Notre-Dame-de-Pontmain",800,100,0,0,0,0,0,0,0,0,800,0,0,800]
["    Lac-du-Cerf",0,0,400,100,0,0,0,0,0,0,400,0,0,400]
["    Saint-Aimé-du-Lac-des-îles",800,100,0,0,0,0,0,0,0,0,800,0,0,800]
["    Kiamika",800,100,0,0,0,0,0,0,0,0,800,0,0,800]
["    Nominingue",1400,66.666666666666657,400,19.047619047619047,400,19.047619047619047,0,0,0,0,2100,0,0,2100]
["    Rivière-Rouge",400,9.3023255813953494,2300,53.488372093023251,400,9.3023255813953494,800,18.604651162790699,400,9.3023255813953494,4300,0,0,4300]
["    La Macaza",0,0,0,0,0,0,400,100,0,0,400,700,58.333333333333336,1200]
["    L'Ascension",800,100,0,0,0,0,0,0,0,0,800,0,0,800]
["    Lac-Saguay",0,0,0,0,500,100,0,0,0,0,500,0,0,500]
["    Chute-Saint-Philippe",500,55.555555555555557,400,44.444444444444443,0,0,0,0,0,0,900,0,0,900]
["    Lac-des-Écorces",500,18.518518518518519,1200,44.444444444444443,600,22.222222222222221,500,18.518518518518519,0,0,2700,0,0,2700]
["    Mont-Laurier",3300,27.731092436974791,2600,21.84873949579832,2000,16.806722689075631,2300,19.327731092436977,1700,14.285714285714285,11900,2200,15.602836879432624,14100]
["    Ferme-Neuve",2300,85.18518518518519,0,0,500,18.518518518518519,0,0,0,0,2700,0,0,2700]
["    Lac-Saint-Paul",500,100,0,0,0,0,0,0,0,0,500,0,0,500]
["   Mont-Saint-Michel",500,100,0,0,0,0,0,0,0,0,500,0,0,500]
["   Sainte-Anne-du-Lac",0,0,600,100,0,0,0,0,0,0,600,0,0,600]
["   Territoires non organisés",0,0,0,0,0,0,0,0,0,0,0,5,100,5]
["1512 - RLS des Laurentides",3300,7.6923076923076925,8000,18.648018648018649,12000,27.972027972027973,12400,28.904428904428904,7200,16.783216783216783,42900,3000,6.5359477124183014,45900]
["    Val-Morin",0,0,0,0,900,31.03448275862069,2000,68.965517241379317,0,0,2900,0,0,2900]
["    Val-David",0,0,0,0,900,18.367346938775512,1800,36.734693877551024,2200,44.897959183673471,4900,0,0,4900]
["    Lantier",0,0,0,0,800,100,0,0,0,0,800,0,0,800]
["    Sainte-Lucie-des-Laurentides",0,0,600,46.153846153846153,700,53.846153846153847,0,0,0,0,1300,0,0,1300]
["    Sainte-Agathe-des-Monts",800,9.0909090909090917,500,5.6818181818181817,1600,18.181818181818183,4300,48.863636363636367,1700,19.318181818181817,8800,1400,13.725490196078432,10200]
["    Ivry-sur-le-Lac",0,0,400,100,0,0,0,0,0,0,400,0,0,400]
["    St-Faustin—Lac-Carré",800,22.857142857142858,1300,37.142857142857146,1000,28.571428571428569,0,0,500,14.285714285714285,3500,0,0,3500]
["    Barkmere",0,0,0,0,0,0,0,0,100,100,100,0,0,100]
["    Montcalm",600,100,0,0,0,0,0,0,0,0,600,0,0,600]
["    Arundel",0,0,0,0,0,0,0,0,600,100,600,0,0,600]
["    Huberdeau",0,0,0,0,500,55.555555555555557,400,44.444444444444443,0,0,900,0,0,900]
["    Amherst",0,0,800,53.333333333333336,0,0,700,46.666666666666664,0,0,1500,0,0,1500]
["    Brébeuf",600,60,400,40,0,0,0,0,0,0,1000,0,0,1000]
["    Lac-Supérieur",0,0,1300,68.421052631578945,600,31.578947368421051,0,0,0,0,1900,0,0,1900]
["    Val-des-Lacs",0,0,700,100,0,0,0,0,0,0,700,0,0,700]
["    Mont-Tremblant",0,0,500,6.25,3100,38.75,2200,27.500000000000004,2200,27.500000000000004,8000,1600,16.666666666666664,9600]
["    La Conception",0,0,800,61.53846153846154,600,46.153846153846153,0,0,0,0,1300,0,0,1300]
["    Labelle",0,0,0,0,1400,56.000000000000007,1000,40,0,0,2500,0,0,2500]
["    Lac-Tremblant-Nord",40,100,0,0,0,0,0,0,0,0,40,0,0,40]
["    La Minerve",500,41.666666666666671,700,58.333333333333336,0,0,0,0,0,0,1200,0,0,1200]
["1513 - RLS des Pays-d'en-Haut",400,0.97560975609756095,3800,9.2682926829268286,9300,22.682926829268293,18100,44.146341463414636,9400,22.926829268292686,41000,900,2.1479713603818613,41900]
["    Estérel",200,100,0,0,0,0,0,0,0,0,200,0,0,200]
["    Sainte-Marguerite-du-Lac-Masson",0,0,800,28.571428571428569,0,0,1900,67.857142857142861,0,0,2800,0,0,2800]
["    Sainte-Adèle",0,0,700,5.4263565891472867,2400,18.604651162790699,5400,41.860465116279073,4400,34.108527131782942,12900,0,0,12900]
["    Piedmont",0,0,0,0,0,0,1200,40,1800,60,3000,0,0,3000]
["    Sainte-Anne-des-Lacs",0,0,600,16.666666666666664,2300,63.888888888888886,700,19.444444444444446,0,0,3600,0,0,3600]
["    Saint-Sauveur",0,0,0,0,2600,27.659574468085108,4300,45.744680851063826,2400,25.531914893617021,9400,900,8.8235294117647065,10200]
["    Morin-Heights",0,0,1000,24.390243902439025,1400,34.146341463414636,1800,43.902439024390247,0,0,4100,0,0,4100]
["    Lac-des-Seize-îles",200,100,0,0,0,0,0,0,0,0,200,0,0,200]
["    Wentworth-Nord",0,0,0,0,700,50,700,50,0,0,1400,0,0,1400]
["    Saint-Adolphe-d'Howard",0,0,700,20,0,0,2000,57.142857142857139,700,20,3500,0,0,3500]
["1514 - RLS d'Argenteuil",2600,8.3333333333333321,11000,35.256410256410255,6800,21.794871794871796,6700,21.474358974358974,4200,13.461538461538462,31200,1100,3.3950617283950617,32400]
["    Saint-André-d'Argenteuil",500,16.666666666666664,600,20,1900,63.333333333333329,0,0,0,0,3000,0,0,3000]
["    Lachute",0,0,2700,23.076923076923077,500,4.2735042735042734,5700,48.717948717948715,2800,23.931623931623932,11700,1100,8.5271317829457356,12900]
["    Gore",1000,52.631578947368418,900,47.368421052631575,0,0,0,0,0,0,1900,0,0,1900]
["    Mille-Isles",0,0,1600,100,0,0,0,0,0,0,1600,0,0,1600]
["    Wentworth",0,0,500,100,0,0,0,0,0,0,500,0,0,500]
["    Brownsburg-Chatham",500,7.042253521126761,2100,29.577464788732392,3900,54.929577464788736,0,0,700,9.8591549295774641,7100,0,0,7100]
["    Grenville-sur-la-Rouge",600,21.428571428571427,1700,60.714285714285708,500,17.857142857142858,0,0,0,0,2800,0,0,2800]
["    Grenville",0,0,0,0,0,0,1000,58.82352941176471,700,41.17647058823529,1700,0,0,1700]
["    Harrington",0,0,800,100,0,0,0,0,0,0,800,0,0,800]
["1515 - RLS de Deux-Montagnes—Mirabel-Sud",26700,23.298429319371728,22200,19.3717277486911,26900,23.472949389179757,20100,17.539267015706805,18700,16.31762652705061,114600,800,0.6932409012131715,115400]
["    Saint-Eustache",14400,33.333333333333329,3900,9.0277777777777768,6500,15.046296296296296,7400,17.12962962962963,10900,25.231481481481481,43200,800,1.8181818181818181,44000]
["    Deux-Montagnes",2600,14.857142857142858,2900,16.571428571428569,2800,16,3900,22.285714285714285,5300,30.285714285714288,17500,0,0,17500]
["    Sainte-Marthe-sur-le-Lac",1700,9.3922651933701662,8100,44.751381215469614,7000,38.674033149171272,800,4.4198895027624303,400,2.2099447513812152,18100,0,0,18100]
["    Pointe-Calumet",1000,15.625,2300,35.9375,500,7.8125,500,7.8125,2100,32.8125,6400,0,0,6400]
["    Saint-Joseph-du-Lac",3600,53.731343283582092,1000,14.925373134328357,2200,32.835820895522389,0,0,0,0,6700,0,0,6700]
["    Oka",600,15.789473684210526,1600,42.105263157894733,1600,42.105263157894733,0,0,0,0,3800,0,0,3800]
["    Saint-Placide",500,29.411764705882355,0,0,0,0,1200,70.588235294117652,0,0,1700,0,0,1700]
["    Mirabel",2300,13.372093023255813,2300,13.372093023255813,6400,37.209302325581397,6200,36.046511627906973,0,0,17200,0,0,17200]
["1516 - RLS de la Rivière-du-Nord—Mirabel-Nord",23000,14.86748545572075,34600,22.365869424692956,31500,20.361990950226243,28900,18.681318681318682,36800,23.787976729153197,154700,6800,4.2105263157894735,161500]
["    Mirabel",900,2.7027027027027026,9700,29.129129129129126,10400,31.231231231231231,7700,23.123123123123122,4600,13.813813813813812,33300,0,0,33300]
["    Saint-Colomban",6500,40.625,5600,35,1400,8.75,2600,16.25,0,0,16000,0,0,16000]
["    Saint-Jérôme",10300,15.259259259259258,7100,10.518518518518519,8800,13.037037037037036,11400,16.888888888888889,30000,44.444444444444443,67500,6800,9.1520861372812909,74300]
["    Sainte-Sophie",3200,20.382165605095544,3900,24.840764331210192,6000,38.216560509554142,2600,16.560509554140125,0,0,15700,0,0,15700]
["    Prévost",2200,16.923076923076923,4700,36.153846153846153,2600,20,1300,10,2200,16.923076923076923,13000,0,0,13000]
["    Saint-Hippolyte",0,0,3600,39.560439560439562,2300,25.274725274725274,3200,35.164835164835168,0,0,9100,0,0,9100]
["1517 - RLS de Thérèse-De Blainville",44300,29.691689008042893,24500,16.420911528150135,21700,14.544235924932977,23800,15.951742627345844,34900,23.391420911528151,149200,7900,5.0286441756842777,157100]
["    Boisbriand",5300,19.702602230483272,5300,19.702602230483272,4600,17.100371747211895,4800,17.843866171003718,6900,25.650557620817843,26900,0,0,26900]
["    Sainte-Thérèse",2100,9.3333333333333339,1500,6.666666666666667,1000,4.4444444444444446,3500,15.555555555555555,14400,64,22500,3500,13.461538461538462,26000]
["    Blainville",17500,32.051282051282051,12200,22.344322344322347,7200,13.186813186813188,11100,20.329670329670328,6600,12.087912087912088,54600,2300,4.0421792618629171,56900]
["    Rosemère",6600,49.253731343283583,1200,8.9552238805970141,1900,14.17910447761194,2500,18.656716417910449,1300,9.7014925373134329,13400,500,3.5714285714285712,14000]
["    Lorraine",6400,68.085106382978722,1800,19.148936170212767,700,7.4468085106382977,400,4.2553191489361701,0,0,9400,0,0,9400]
["    Bois-des-Filion",500,5.376344086021505,1000,10.75268817204301,1500,16.129032258064516,1600,17.20430107526882,4700,50.537634408602152,9300,300,3.125,9600]
["    Sainte-Anne-des-Plaines",6000,45.801526717557252,1400,10.687022900763358,4700,35.877862595419849,0,0,1000,7.6335877862595423,13100,1300,9.0277777777777768,14400]

{"sheet":"Liste","index":4,"n_rows":53,"n_cols":6,"rows_kept":53,"cut":false,"hidden":false,"merged":[]}
[null,null,null,"Matérielle et sociale"]
[null,null,null,"Matérielle"]
[null,null,null,"Sociale"]
[720,"MRC  Deux-Montagnes","Local"]
[730,"MRC Thérèse-De Blainville","Local"]
[740,"Mirabel","Local"]
[750,"MRC la Rivière-du-Nord","Local"]
[760,"MRC Argenteuil","Local"]
[770,"MRC Les Pays-d'en-Haut","Local"]
[780,"MRC Les Laurentides","Local"]
[790,"MRC Antoine-Labelle","Local"]
[]
[]
[]
[]
[]
[]
[]
[]
[]
[]
[]
[720,"Région selon RLS","Regional"]
[15992,"Région selon MRC","Régional"]
[15993,"Liste des RLS et leurs régions","Régional"]
[720,"MRC Deux-Montagnes","Régional"]
[1515,"RLS de Deux-Montagnes - Mirabel-Sud","Régional"]
["730-1517","MRC/RLS Thérèse-De Blainville","Régional"]
[740,"Mirabel","Régional"]
[750,"MRC la Rivière-du-Nord","Régional"]
[1516,"RLS de la Rivière-du-Nord - Mirabel-Nord","Régional"]
["760-1514","MRC/RLS Argenteuil","Régional"]
["770-1513","MRC/RLS Les Pays-d'en-Haut","Régional"]
["780-1512","MRC/RLS Les Laurentides","Régional"]
["790-1511","MRC/RLS Antoine-Labelle","Régional"]
[]
[]
[]
[]
[]
[null,null,null,15991,"Région selon RLS","Regional"]
[null,null,null,15992,"Région selon MRC","Régional"]
[null,null,null,15993,"Liste des RLS et leurs municipalités","Régional"]
[null,null,null,720,"MRC Deux-Montagnes","Régional"]
[null,null,null,1515,"RLS de Deux-Montagnes - Mirabel-Sud","Régional"]
[null,null,null,"730-1517","MRC/RLS Thérèse-De Blainville","Régional"]
[null,null,null,740,"Mirabel","Régional"]
[null,null,null,750,"MRC la Rivière-du-Nord","Régional"]
[null,null,null,1516,"RLS de la Rivière-du-Nord - Mirabel-Nord","Régional"]
[null,null,null,"760-1514","MRC/RLS Argenteuil","Régional"]
[null,null,null,"770-1513","MRC/RLS Les Pays-d'en-Haut","Régional"]
[null,null,null,"780-1512","MRC/RLS Les Laurentides","Régional"]
[null,null,null,"790-1511","MRC/RLS Antoine-Labelle","Régional"]

{"sheet":"Correspondance","index":5,"n_rows":91,"n_cols":35,"rows_kept":91,"cut":false,"hidden":false,"merged":[]}
["Id Territoire","Concanetation","Territoire","Type défavo","Plage Total","Plage en-tête","Plage Q5","Plage Q5 en-tête","Plage Q5 Territoire","PNG Carte","Nom carte","Endroit Copie Tableau","Endroit Copie en-tête","Endroit Copie Tableau Q5","Endroit Copie Q5 en-tête","Endroit Copie Tableau Territoire Q5","Texte carte","Texte tableau","Texte 2011","Endroit texte carte","Endroit texte tableau","Titre","Source","Endroit Source","Hauteur Ligne 4","Titre Q5","Source DSP","Endroit Source DSP","Note Pop sans indice","Endroit Note Pop sans indice","Lien vers Cartes 2011","Plage Tableau à copier","Plage Tableau Q5 à copier","Titre carte","Tableau Plus Défavo"]
[]
[]
[]
[]
[]
[]
[]
[]
[]
[]
[]
[]
[]
[]
[]
[]
[]
[]
[]
[]
[]
[]
[]
[]
[]
[]
[]
[720,{"$f":"A29&D29&C29","v":"720Matérielle et socialeLocal"},"Local","Matérielle et sociale","A7:O14","A1:N4","J7:K14","A12:B15","A7:A14","MRC_DeuxMontagnes_Defavo_2016_Comb.png","MRC_DM_2016_Comb","A6","B2","B6","B2","A6","Dans la MRC de Deux-Montagnes, les secteurs ayant des conditions parmi les plus défavorables de la MRC à la fois sur le plan matériel et social (profil 5 – en violet) sont localisés à Pointe-Calumet et à Saint-Eustache. À Pointe-Calumet, près du tiers de la population habite dans ces secteurs.\n\nLes secteurs où les conditions sont parmi les plus défavorables de la MRC seulement sur le plan social (profil 3 – en bleu) se trouvent à Pointe-Calumet, la municipalité de Deux-Montagnes, Saint-Eustache et à Sainte-Marthe-sur-le-Lac. Plus du tiers de la population de la municipalité de Deux-Montagnes habite dans ces secteurs.\n\nOn retrouve des secteurs qui présentent les conditions parmi les plus défavorables de la MRC seulement sur le plan matériel (profil 4 – en orangé) dans toutes les municipalités du territoire. Plus de la moitié de la population de Saint-Placide et de Pointe-Calumet réside dans ces secteurs.\n\nMise à jour : janvier 2024","Dans la MRC de Deux-Montagnes, les secteurs ayant des conditions parmi les plus défavorables de la MRC à la fois sur le plan matériel et social (profil 5) sont localisés à Pointe-Calumet et à Saint-Eustache. À Pointe-Calumet, près du tiers de la population habite dans ces secteurs.\n\nLes secteurs où les conditions sont parmi les plus défavorables de la MRC seulement sur le plan social (profil 3) se trouvent à Pointe-Calumet, la municipalité de Deux-Montagnes, Saint-Eustache et à Sainte-Marthe-sur-le-Lac. Plus du tiers de la population de la municipalité de Deux-Montagnes habite dans ces secteurs.\n\nOn retrouve des secteurs qui présentent les conditions parmi les plus défavorables de la MRC seulement sur le plan matériel (profil 4) dans toutes les municipalités du territoire. Plus de la moitié de la population de Saint-Placide et de Pointe-Calumet réside dans ces secteurs.\n\nMise à jour : janvier 2024",null,"J3:O40","A19:K34","Répartition de la population selon les profils de défavorisation matérielle et sociale combinée 2021 de la MRC de Deux-Montagnes","Source : INSPQ et BIESP, 2023. Statistique Canada, Recensement 2021.","A14","49.5","Population des secteurs ayant les conditions matérielles et sociales les plus défavorables de la MRC de Deux-Montagnes, 2021","Panorama de la défavorisation dans les Laurentides 2021, produit par l’équipe Surveillance, recherche et évaluation, Direction de santé publique des Laurentides, Centre intégré de santé et de services sociaux des Laurentides, 2024","A15","La population sans indice réside dans des secteurs où l’information pour le calcul de l’indice est indisponible à cause des ménages collectifs (centres d’hébergement, pénitenciers) ou du taux de non-réponse trop élevé.","A16","https://www.santelaurentides.gouv.qc.ca/sante-publique/donnees-sur-la-population/panorama-de-la-defavorisation/","A1:O16","A1:O14","Répartition de la population selon les profils de défavorisation matérielle et sociale combinée 2021 de la MRC de Deux-Montagnes","Dans la MRC de Deux-Montagnes, les secteurs ayant des conditions parmi les plus défavorables de la MRC à la fois sur le plan matériel et social (profil 5) sont localisés à Pointe-Calumet et à Saint-Eustache. À Pointe-Calumet, près du tiers de la population habite ces secteurs.\n\nMise à jour : janvier 2024"]
[720,"720MatérielleLocal","Local","Matérielle","A280:K287","A23:J25","F280:G287","A28:B30","A280:A287","MRC_DeuxMontagnes_Defavo_2016_Mat.png","MRC_DM_2016_Mat","A5","B2","B5","B2","A5","Dans la MRC de Deux-Montagnes, on retrouve des secteurs ayant les conditions matérielles parmi les plus défavorables (quartile 4 – en orangé) de la MRC dans toutes les municipalités. \n\nPlus de 80 % de la population de Pointe-Calumet et plus de la moitié de celle de Saint-Placide habitent ces secteurs.\n\nMise à jour : janvier 2024","Dans la MRC de Deux-Montagnes, on retrouve des secteurs ayant les conditions matérielles parmi les plus défavorables (quartile 4) de la MRC dans toutes les municipalités. \n\nPlus de 80 % de la population de Pointe-Calumet et plus de la moitié de celle de Saint-Placide habitent ces secteurs.\n\nMise à jour : janvier 2024",null,"J3:O40","A17:K32","Répartition de la population selon le niveau de défavorisation matérielle 2021 de la MRC de Deux-Montagnes","Source : INSPQ et BIESP, 2023. Statistique Canada, Recensement 2021.","A13","16.5","Population des secteurs ayant les conditions matérielles les plus défavorables de la MRC de Deux-Montagnes, 2021","Panorama de la défavorisation dans les Laurentides 2021, produit par l’équipe Surveillance, recherche et évaluation, Direction de santé publique des Laurentides, Centre intégré de santé et de services sociaux des Laurentides, 2024","A14","La population sans indice réside dans des secteurs où l’information pour le calcul de l’indice est indisponible à cause des ménages collectifs (centres d’hébergement, pénitenciers) ou du taux de non-réponse trop élevé.","A15","https://www.santelaurentides.gouv.qc.ca/sante-publique/donnees-sur-la-population/panorama-de-la-defavorisation/","A1:O15","A1:O13","Répartition de la population selon le niveau de défavorisation matérielle 2021 de la MRC de Deux-Montagnes","Dans la MRC de Deux-Montagnes, on retrouve des secteurs ayant les conditions matérielles parmi les plus défavorables (quartile 4) de la MRC dans toutes les municipalités. \n\nPlus de 80 % de la population de Pointe-Calumet et plus de la moitié de celle de Saint-Placide habitent ces secteurs.\n\nMise à jour : janvier 2024"]
[720,"720SocialeLocal","Local","Sociale","A371:K378","A23:J25","F371:G378","A28:B30","A371:A378","MRC_DeuxMontagnes_Defavo_2016_Soc.png","MRC_DM_2016_Soc","A5","B2","B5","B2","A5","Dans la MRC de Deux-Montagnes, les secteurs ayant les conditions sociales parmi les plus défavorables (quartile 4 – en orangé) de la MRC se répartissent dans Pointe-Calumet, la municipalité de Deux-Montagnes, Saint-Eustache et Sainte-Marthe-sur-le-Lac. Environ la moitié de la population de Pointe-Calumet et environ le tiers  de la population de la municipalité de Deux-Montagnes et de Saint-Eustache habitent dans ces secteurs. \n\nMise à jour : janvier 2024","Dans la MRC de Deux-Montagnes, les secteurs ayant les conditions sociales parmi les plus défavorables (quartile 4) de la MRC se répartissent dans Pointe-Calumet, la municipalité de Deux-Montagnes, Saint-Eustache et Sainte-Marthe-sur-le-Lac. Environ la moitié de la population de Pointe-Calumet et environ le tiers de la population de la municipalité de Deux-Montagnes et de Saint-Eustache habitent dans ces secteurs. \n\nMise à jour : janvier 2024",null,"J3:O40","A17:K32","Répartition de la population selon le niveau de défavorisation sociale 2021 de la MRC de Deux-Montagnes","Source : INSPQ et BIESP, 2023. Statistique Canada, Recensement 2021.","A13","16.5","Population des secteurs ayant les conditions sociales les plus défavorables de la MRC de Deux-Montagnes, 2021","Panorama de la défavorisation dans les Laurentides 2021, produit par l’équipe Surveillance, recherche et évaluation, Direction de santé publique des Laurentides, Centre intégré de santé et de services sociaux des Laurentides, 2024","A14","La population sans indice réside dans des secteurs où l’information pour le calcul de l’indice est indisponible à cause des ménages collectifs (centres d’hébergement, pénitenciers) ou du taux de non-réponse trop élevé.","A15","https://www.santelaurentides.gouv.qc.ca/sante-publique/donnees-sur-la-population/panorama-de-la-defavorisation/","A1:O15","A1:O13","Répartition de la population selon le niveau de défavorisation sociale 2021 de la MRC de Deux-Montagnes","Dans la MRC de Deux-Montagnes, les secteurs ayant les conditions sociales parmi les plus défavorables (quartile 4) de la MRC se répartissent dans Pointe-Calumet, la municipalité de Deux-Montagnes, Saint-Eustache et Sainte-Marthe-sur-le-Lac. Environ la moitié de la population de Pointe-Calumet et environ le tiers de la population de la municipalité de Deux-Montagnes et de Saint-Eustache habitent ces secteurs. \n\nMise à jour : janvier 2024"]
[730,"730Matérielle et socialeLocal","Local","Matérielle et sociale","A15:O22","A1:N4","J15:K22","A12:B15","A15:A22","MRC_ThereseBlainville_Defavo_2016_Comb.png","MRC_TDB_2016_Comb","A6","B2","B6","B2","A6","Dans la MRC de Thérèse-De Blainville, les secteurs ayant les conditions parmi les plus défavorables de la MRC à la fois sur le plan matériel et social (profil 5 – en violet) sont localisés à Sainte-Thérèse, Sainte-Anne-des-Plaines, Boisbriand et à Blainville. À Sainte-Thérèse, c’est près du quart de la population qui habite dans ces secteurs.\n\nLes secteurs où les conditions sont parmi les plus défavorables de la MRC seulement sur le plan social (profil 3 – en bleu) se retrouvent dans toutes les municipalités du territoire, SAUF à Lorraine et à Sainte-Anne-des-Plaines. Plus du tiers de la population de Sainte-Thérèse et près de la moitié de celle de Bois-des-Filion résident dans ces secteurs de profil 3.\n\nOn retrouve des secteurs qui présentent les conditions parmi les plus défavorables de la MRC uniquement sur le plan matériel (profil 4 – en orangé) dans toutes les municipalités du territoire SAUF à Lorraine et à Rosemère. La moitié de la population de Sainte-Anne-des-Plaines et le tiers de celle de Boisbriand résident dans ces secteurs.\n\nMise à jour : janvier 2024 ","Dans la MRC de Thérèse-De Blainville, les secteurs ayant les conditions parmi les plus défavorables de la MRC à la fois sur le plan matériel et social (profil 5) sont localisés à Sainte-Thérèse, Sainte-Anne-des-Plaines, Boisbriand et à Blainville. À Sainte-Thérèse, c’est près du quart de la population qui habite ces secteurs.\n\nLes secteurs où les conditions sont parmi les plus défavorables de la MRC seulement sur le plan social (profil 3) se retrouvent dans toutes les municipalités du territoire, SAUF à Lorraine et à Sainte-Anne-des-Plaines. Plus du tiers de la population de Sainte-Thérèse et près de la moitié de celle de Bois-des-Filion résident dans ces secteurs de profil 3.\n\nOn retrouve des secteurs qui présentent les conditions parmi les plus défavorables de la MRC uniquement sur le plan matériel (profil 4) dans toutes les municipalités du territoire SAUF à Lorraine et à Rosemère. La moitié de la population de Sainte-Anne-des-Plaines et le tiers de celle de Boisbriand résident dans ces secteurs.\n\nMise à jour : janvier 2024",null,"J3:O40","A18:K33","Répartition de la population selon les profils de défavorisation matérielle et sociale combinée 2021 de la MRC de Thérèse-De Blainville","Source : INSPQ et BIESP, 2023. Statistique Canada, Recensement 2021.","A14","49.5","Population des secteurs ayant les conditions matérielles et sociales les plus défavorables de la MRC de Thérèse-De Blainville, 2021","Panorama de la défavorisation dans les Laurentides 2021, produit par l’équipe Surveillance, recherche et évaluation, Direction de santé publique des Laurentides, Centre intégré de santé et de services sociaux des Laurentides, 2024","A15","La population sans indice réside dans des secteurs où l’information pour le calcul de l’indice est indisponible à cause des ménages collectifs (centres d’hébergement, pénitenciers) ou du taux de non-réponse trop élevé.","A16","https://www.santelaurentides.gouv.qc.ca/sante-publique/donnees-sur-la-population/panorama-de-la-defavorisation/","A1:O16","A1:O15","Répartition de la population selon les profils de défavorisation matérielle et sociale combinée 2021 de la MRC de Thérèse-De Blainville","Dans la MRC de Thérèse-De Blainville, les secteurs ayant les conditions parmi les plus défavorables de la MRC à la fois sur le plan matériel et social (profil 5) sont localisés à Sainte-Thérèse, Sainte-Anne-des-Plaines, Boisbriand et à Blainville. À Sainte-Thérèse, c’est près du quart de la population qui habite dans ces secteurs.\n\nMise à jour : janvier 2024 "]
[730,"730MatérielleLocal","Local","Matérielle","A288:K295","A23:J25","F288:G295","A28:B30","A288:A295","MRC_ThereseBlainville_Defavo_2016_Mat.png","MRC_TDB_2016_Mat","A5","B2","B5","B2","A5","Dans la MRC Thérèse-De Blainville, les secteurs ayant les conditions matérielles parmi les plus défavorables (quartile 4 – en orangé) de la MRC sont localisés à Sainte-Anne-des-Plaines, Boisbriand, Sainte-Thérèse, Bois-des-Filion et à Blainville. Les deux-tiers de la population de Sainte-Anne-des-Plaines et près de la moitié de celle de Boisbriand habitent ces secteurs.\n\nMise à jour : janvier 2024","Dans la MRC Thérèse-De Blainville, les secteurs ayant les conditions matérielles parmi les plus défavorables (quartile 4) de la MRC sont localisés à Sainte-Anne-des-Plaines, Boisbriand, Sainte-Thérèse, Bois-des-Filion et à Blainville. Les deux-tiers de la population de Sainte-Anne-des-Plaines et près de la moitié de celle de Boisbriand habitent ces secteurs.\n\nMise à jour : janvier 2024",null,"J3:O40","A17:K32","Répartition de la population selon le niveau de défavorisation matérielle 2021 de la MRC de Thérèse-De Blainville","Source : INSPQ et BIESP, 2023. Statistique Canada, Recensement 2021.","A13","16.5","Population des secteurs ayant les conditions matérielles les plus défavorables de la MRC de Thérèse-De Blainville, 2021","Panorama de la défavorisation dans les Laurentides 2021, produit par l’équipe Surveillance, recherche et évaluation, Direction de santé publique des Laurentides, Centre intégré de santé et de services sociaux des Laurentides, 2024","A14","La population sans indice réside dans des secteurs où l’information pour le calcul de l’indice est indisponible à cause des ménages collectifs (centres d’hébergement, pénitenciers) ou du taux de non-réponse trop élevé.","A15","https://www.santelaurentides.gouv.qc.ca/sante-publique/donnees-sur-la-population/panorama-de-la-defavorisation/","A1:O15","A1:O14","Répartition de la population selon le niveau de défavorisation matérielle 2021 de la MRC de Thérèse-De Blainville","Dans la MRC Thérèse-De Blainville, les secteurs ayant les conditions matérielles parmi les plus défavorables (quartile 4) de la MRC sont localisés à Sainte-Anne-des-Plaines, Boisbriand, Sainte-Thérèse, Bois-des-Filion et à Blainville. Les deux-tiers de la population de Sainte-Anne-des-Plaines et près de la moitié de celle de Boisbriand habitent ces secteurs.\n\nMise à jour : janvier 2024 "]
[730,"730SocialeLocal","Local","Sociale","A379:K386","A23:J25","F379:G386","A28:B30","A379:A386","MRC_ThereseBlainville_Defavo_2016_Soc.png","MRC_TDB_2016_Soc","A5","B2","B5","B2","A5","Dans la MRC Thérèse-De Blainville, les secteurs ayant les conditions sociales parmi les plus défavorables (quartile  4 – en orangé) de la MRC sont répartis dans toutes les municipalités du territoire, SAUF à Lorraine. Environ la moitié de la population de Sainte-Thérèse et de Bois-des-Filion habite ces secteurs. C’est aussi le cas pour plus du quart des résidents de Boisbriand.\n\nMise à jour : janvier 2024 ","Dans la MRC Thérèse-De Blainville, les secteurs ayant les conditions sociales parmi les plus défavorables (quartile 4) de la MRC sont répartis dans toutes les municipalités du territoire, SAUF à Lorraine. Environ la moitié de la population de Sainte-Thérèse et de Bois-des-Filion habite ces secteurs. C’est aussi le cas pour plus du quart des résidents de Boisbriand.\n\nMise à jour : janvier 2024",null,"J3:O40","A17:K32","Répartition de la population selon le niveau de défavorisation sociale 2021 de la MRC de Thérèse-De Blainville","Source : INSPQ et BIESP, 2023. Statistique Canada, Recensement 2021.","A13","16.5","Population des secteurs ayant les conditions sociales les plus défavorables de la MRC de Thérèse-De Blainville, 2021","Panorama de la défavorisation dans les Laurentides 2021, produit par l’équipe Surveillance, recherche et évaluation, Direction de santé publique des Laurentides, Centre intégré de santé et de services sociaux des Laurentides, 2024","A14","La population sans indice réside dans des secteurs où l’information pour le calcul de l’indice est indisponible à cause des ménages collectifs (centres d’hébergement, pénitenciers) ou du taux de non-réponse trop élevé.","A15","https://www.santelaurentides.gouv.qc.ca/sante-publique/donnees-sur-la-population/panorama-de-la-defavorisation/","A1:O15","A1:O14","Répartition de la population selon le niveau de défavorisation sociale 2021 de la MRC de Thérèse-De Blainville","Dans la MRC Thérèse-De Blainville, les secteurs ayant les conditions sociales parmi les plus défavorables (quartile 4) de la MRC sont répartis dans toutes les municipalités du territoire, SAUF à Lorraine. Environ la moitié de la population de Sainte-Thérèse et de Bois-des-Filion habite ces secteurs. C’est aussi le cas pour plus du quart des résidents de Boisbriand.\n\nMise à jour : janvier 2024 "]
[740,"740Matérielle et socialeLocal","Local","Matérielle et sociale","A23:O23","A1:N4","J23:K23","A12:B15","A23:A23","MRC_Mirabel_Defavo_2016_Comb.png","MRC_MIR_2016_Comb","A6","B2","B6","B2","A6","On remarque des secteurs ayant les conditions les plus défavorisées matériellement et socialement (profil 5 – en violet) de Mirabel dans les secteurs de Saint-Janvier et de Saint-Augustin. \n\nLes secteurs qui présentent les conditions les plus défavorables de Mirabel seulement sur le plan social (profil 3 – en bleu) se situent dans Saint-Canut, Saint-Janvier, Le Petit-Brûlé, Saint-Augustin et à Saint-Benoît.\n \nLes secteurs dont les conditions sont les plus défavorables sur le plan matériel seulement (profil 4 – en orangé) se situent dans Saint-Canut, Sainte-Monique, Saint-Janvier et Saint-Augustin.\n\nMise à jour : janvier 2024","6,1% de la population de Mirabel, soit 3 700 personnes, habitent des secteurs ayant les conditions parmi les plus défavorables de Mirabel à la fois sur le plan matériel et social (profil 5).\n\nLes secteurs qui présentent les conditions plus défavorables uniquement sur le plan social (profil 3) regroupent 18,4 % de la population (11 200 personnes).\n\nLes secteurs dont les conditions sont les plus défavorables seulement sur le plan matériel (profil 4) sont le lieu de résidence de 19,2 % de la population de la municipalité, ce qui correspond à 11 700 personnes.\n\nMise à jour : janvier 2024",null,"J3:O40","A12:K27","Répartition de la population selon les profils de défavorisation matérielle et sociale combinée 2021 de Mirabel","Source : INSPQ et BIESP, 2023. Statistique Canada, Recensement 2021.","A8","49.5","Population des secteurs ayant les conditions matérielles et sociales les plus défavorables de Mirabel, 2021","Panorama de la défavorisation dans les Laurentides 2021, produit par l’équipe Surveillance, recherche et évaluation, Direction de santé publique des Laurentides, Centre intégré de santé et de services sociaux des Laurentides, 2024","A9","La population sans indice réside dans des secteurs où l’information pour le calcul de l’indice est indisponible à cause des ménages collectifs (centres d’hébergement, pénitenciers) ou du taux de non-réponse trop élevé.","A10","https://www.santelaurentides.gouv.qc.ca/sante-publique/donnees-sur-la-population/panorama-de-la-defavorisation/","A1:O10","A1:O9","Répartition de la population selon les profils de défavorisation matérielle et sociale combinée 2021 de Mirabel","6,1% de la population de Mirabel, soit 3 700 personnes, habitent des secteurs ayant les conditions parmi les plus défavorables de Mirabel à la fois sur le plan matériel et social (profil 5).\n\nMise à jour : janvier 2024"]
[740,"740MatérielleLocal","Local","Matérielle","A296:K297","A23:J25","F296:G296","A28:B30","A296:A296","MRC_Mirabel_Defavo_2016_Mat.png","MRC_MIR_2016_Mat","A5","B2","B5","B2","A5","Les secteurs de Mirabel ayant les conditions matérielles les plus défavorables (quartile 4 – en orangé) se situent essentiellement dans Saint-Canut, Saint-Hermas, Saint-Benoît, Le Petit-Brûlé, Saint-Augustin et Saint-Janvier. \n\nMise à jour : janvier 2024","Le quart de la population de Mirabel habitent les secteurs ayant les conditions matérielles les plus défavorables (quartile 4), ce qui correspond à près de 15 400 personnes. \n\nMise à jour : janvier 2024",null,"J3:O40","A11:K26","Répartition de la population selon le niveau de défavorisation matérielle 2021 de Mirabel","Source : INSPQ et BIESP, 2023. Statistique Canada, Recensement 2021.","A7","16.5","Population des secteurs ayant les conditions matérielles les plus défavorables de Mirabel, 2021","Panorama de la défavorisation dans les Laurentides 2021, produit par l’équipe Surveillance, recherche et évaluation, Direction de santé publique des Laurentides, Centre intégré de santé et de services sociaux des Laurentides, 2024","A8","La population sans indice réside dans des secteurs où l’information pour le calcul de l’indice est indisponible à cause des ménages collectifs (centres d’hébergement, pénitenciers) ou du taux de non-réponse trop élevé.","A9","https://www.santelaurentides.gouv.qc.ca/sante-publique/donnees-sur-la-population/panorama-de-la-defavorisation/","A1:O9","A1:O8","Répartition de la population selon le niveau de défavorisation matérielle 2021 de Mirabel","Le quart de la population de Mirabel habitant les secteurs ayant les conditions matérielles les plus défavorables (quartile 4), ce qui correspond à près de 15 400 personnes. \n\nMise à jour : janvier 2024"]
[740,"740SocialeLocal","Local","Sociale","A387:K387","A23:J25","F387:G387","A28:B30","A387:A387","MRC_Mirabel_Defavo_2016_Soc.png","MRC_MIR_2016_Soc","A5","B2","B5","B2","A5","Les secteurs de Mirabel ayant les conditions sociales les plus défavorables (quartile  4 – en orangé) se situent essentiellement dans Saint-Canut, Sainte-Monique, Saint-Augustin et Saint-Janvier. \n\nMise à jour : janvier 2024","Le quart de la population de Mirabel habitant des secteurs ayant les conditions sociales les plus défavorables (quartile 4) correspond à environ 15 000 personnes. \n\nMise à jour : janvier 2024",null,"J3:O40","A11:K26","Répartition de la population selon le niveau de défavorisation sociale 2021 de Mirabel","Source : INSPQ et BIESP, 2023. Statistique Canada, Recensement 2021.","A7","16.5","Population des secteurs ayant les conditions sociales les plus défavorables de la Mirabel, 2021","Panorama de la défavorisation dans les Laurentides 2021, produit par l’équipe Surveillance, recherche et évaluation, Direction de santé publique des Laurentides, Centre intégré de santé et de services sociaux des Laurentides, 2024","A8","La population sans indice réside dans des secteurs où l’information pour le calcul de l’indice est indisponible à cause des ménages collectifs (centres d’hébergement, pénitenciers) ou du taux de non-réponse trop élevé.","A9","https://www.santelaurentides.gouv.qc.ca/sante-publique/donnees-sur-la-population/panorama-de-la-defavorisation/","A1:O9","A1:O8","Répartition de la population selon le niveau de défavorisation sociale 2021 de Mirabel","Le quart de la population de Mirabel habitant des secteurs ayant les conditions sociales les plus défavorables (quartile 4) correspond à environ 15 000 personnes. \n\nMise à jour : janvier 2024"]
[750,"750Matérielle et socialeLocal","Local","Matérielle et sociale","A25:O30","A1:N4","J25:K30","A12:B15","A25:A30","MRC_RiviereN_Defavo_2016_Comb.png","MRC_RDN_2016_Comb","A6","B2","B6","B2","A6","Dans la MRC de la Rivière-du-Nord, les secteurs ayant les conditions parmi les plus défavorables de la MRC à la fois au plan matériel et social (profil 5 – en violet) sont localisés à Saint-Jérôme, dont près d’un cinquième de la population habite ces secteurs.\n\nLes secteurs où les conditions sont parmi les plus défavorables de la MRC seulement au plan social (profil 3 – en bleu) se trouvent à Saint-Jérôme et Prévost. \n\nOn retrouve des secteurs qui présentent les conditions parmi les plus défavorables uniquement au plan matériel (profil 4 – en orangé) dans toutes les municipalités du territoire, sauf à Prévost. Près de la moitié de la population de Sainte-Sophie réside dans ces secteurs.\n\nMise à jour : janvier 2024","Dans la MRC de la Rivière-du-Nord, les secteurs ayant les conditions parmi les plus défavorables de la MRC à la fois au plan matériel et social (profil 5) sont localisés à Saint-Jérôme, dont près d’un cinquième de sa population habite ces secteurs.\n\nLes secteurs où les conditions sont parmi les plus défavorables de la MRC seulement au plan social (profil 3) se trouvent à Saint-Jérôme et à Prévost. \n\nOn retrouve des secteurs qui présentent les conditions parmi les plus défavorables uniquement au plan matériel (profil 4) dans toutes les municipalités du territoire, SAUF à Prévost. Près de la moitié de la population de Sainte-Sophie réside dans ces secteurs.\n\nMise à jour : janvier 2024",null,"J3:O40","A16:K31","Répartition de la population selon les profils de défavorisation matérielle et sociale combinée 2021 de la MRC de la Rivière-du-Nord","Source : INSPQ et BIESP, 2023. Statistique Canada, Recensement 2021.","A12","49.5","Population des secteurs ayant les conditions matérielles et sociales les plus défavorables de la MRC de la Rivière-du-Nord, 2021","Panorama de la défavorisation dans les Laurentides 2021, produit par l’équipe Surveillance, recherche et évaluation, Direction de santé publique des Laurentides, Centre intégré de santé et de services sociaux des Laurentides, 2024","A13","La population sans indice réside dans des secteurs où l’information pour le calcul de l’indice est indisponible à cause des ménages collectifs (centres d’hébergement, pénitenciers) ou du taux de non-réponse trop élevé.","A14","https://www.santelaurentides.gouv.qc.ca/sante-publique/donnees-sur-la-population/panorama-de-la-defavorisation/","A1:O14","A1:O13","Répartition de la population selon les profils de défavorisation matérielle et sociale combinée 2021 de la MRC de la Rivière-du-Nord","Dans la MRC de la Rivière-du-Nord, les secteurs ayant les conditions parmi les plus défavorables de la MRC à la fois au plan matériel et social (profil 5) sont localisés à Saint-Jérôme, dont près d’un cinquième de la population habite ces secteurs.\nMise à jour : janvier 2024"]
[750,"750MatérielleLocal","Local","Matérielle","A298:K303","A23:J25","F298:G303","A28:B30","A298:A303","MRC_RiviereN_Defavo_2016_Mat.png","MRC_RDN_2016_Mat","A5","B2","B5","B2","A5","Toutes les municipalités de la MRC de la Rivière-du-Nord SAUF Prévost comportent des secteurs ayant les conditions matérielles parmi les plus défavorables (quartile 4 – en orangé) de la MRC. Près de la moitié de la population de Sainte-Sophie et un tiers de celle de Saint-Jérôme habitent ces secteurs. \n\nMise à jour : janvier 2024","Toutes les municipalités de la MRC de la Rivière-du-Nord SAUF Prévost comportent des secteurs ayant les conditions matérielles parmi les plus défavorables (quartile 4) de la MRC. Près de la moitié de la population de Sainte-Sophie et un tiers de celle de Saint-Jérôme habitent ces secteurs. \n\nMise à jour janvier 2024",null,"J3:O40","A15:K30","Répartition de la population selon le niveau de défavorisation matérielle 2021 de MRC de la Rivière-du-Nord","Source : INSPQ et BIESP, 2023. Statistique Canada, Recensement 2021.","A11","16.5","Population des secteurs ayant les conditions matérielles les plus défavorables de la MRC de la Rivière-du-Nord, 2021","Panorama de la défavorisation dans les Laurentides 2021, produit par l’équipe Surveillance, recherche et évaluation, Direction de santé publique des Laurentides, Centre intégré de santé et de services sociaux des Laurentides, 2024","A12","La population sans indice réside dans des secteurs où l’information pour le calcul de l’indice est indisponible à cause des ménages collectifs (centres d’hébergement, pénitenciers) ou du taux de non-réponse trop élevé.","A13","https://www.santelaurentides.gouv.qc.ca/sante-publique/donnees-sur-la-population/panorama-de-la-defavorisation/","A1:O13","A1:O12","Répartition de la population selon le niveau de défavorisation matérielle 2021 de MRC de la Rivière-du-Nord","Toutes les municipalités de la MRC de la Rivière-du-Nord SAUF Prévost comportent des secteurs ayant les conditions matérielles parmi les plus défavorables (quartile 4) de la MRC. Près de la moitié de la population de Sainte-Sophie et un tiers de celle de Saint-Jérôme habitent ces secteurs. \n\nMise à jour : janvier 2024"]
[750,"750SocialeLocal","Local","Sociale","A389:K394","A23:J25","F389:G394","A28:B30","A389:A394","MRC_RiviereN_Defavo_2016_Soc.png","MRC_RDN_2016_Soc","A5","B2","B5","B2","A5","Dans la MRC de la Rivière-du-Nord, les secteurs ayant les conditions sociales parmi les plus défavorables (quartile 4 – en orangé) de la MRC sont localisés à Prévost et à Saint-Jérôme. Plus de 40 % des Jérômiens habitent ces secteurs. \n\nMise à jour : janvier 2024","Dans la MRC de la Rivière-du-Nord, les secteurs ayant les conditions sociales parmi les plus défavorables (quartile 4) de la MRC sont localisés à Prévost et à Saint-Jérôme. Plus de 40 % des Jérômiens habitent ces secteurs. \n\nMise à jour : janvier 2024",null,"J3:O40","A15:K30","Répartition de la population selon le niveau de défavorisation sociale 2021 de la MRC de la Rivière-du-Nord","Source : INSPQ et BIESP, 2023. Statistique Canada, Recensement 2021.","A11","16.5","Population des secteurs ayant les conditions sociales les plus défavorables de la MRC de la Rivière-du-Nord, 2021","Panorama de la défavorisation dans les Laurentides 2021, produit par l’équipe Surveillance, recherche et évaluation, Direction de santé publique des Laurentides, Centre intégré de santé et de services sociaux des Laurentides, 2024","A12","La population sans indice réside dans des secteurs où l’information pour le calcul de l’indice est indisponible à cause des ménages collectifs (centres d’hébergement, pénitenciers) ou du taux de non-réponse trop élevé.","A13","https://www.santelaurentides.gouv.qc.ca/sante-publique/donnees-sur-la-population/panorama-de-la-defavorisation/","A1:O13","A1:O12","Répartition de la population selon le niveau de défavorisation sociale 2021 de la MRC de la Rivière-du-Nord","Dans la MRC de la Rivière-du-Nord, les secteurs ayant les conditions sociales parmi les plus défavorables (quartile 4) de la MRC sont localisés à Prévost et à Saint-Jérôme. Plus de 40 % des Jérômiens habitent ces secteurs. \n\nMise à jour : janvier 2024"]
[760,"760Matérielle et socialeLocal","Local","Matérielle et sociale","A31:O40","A1:N4","J31:K40","A12:B15","A31:A40","MRC_Argenteuil_Defavo_2016_Comb.png","MRC_ARG_2016_Comb","A6","B2","B6","B2","A6","Dans la MRC d’Argenteuil, les secteurs ayant les conditions parmi les plus défavorables de la MRC à la fois sur le plan matériel et social (profil 5 – en violet) sont tous localisés à Lachute. Près du tiers de la population de Lachute habite ces secteurs.\n\nLes secteurs où les conditions sont les parmi les plus défavorables de la MRC sur le plan social uniquement (profil 3 – en bleu) se trouvent à Grenville, Lachute et à Brownsburg-Chatham. L’ensemble de la population de Grenville réside dans ces secteurs.\n\nOn retrouve des secteurs qui présentent les conditions parmi les plus défavorables de la MRC seulement sur le plan matériel (profil 4 – en orangé) à Brownsburg-Chatham, à Grenville-sur-la-Rouge et à Lachute. Environ un quart des résidents de Brownsburg-Chatham et de Grenville-sur-la Rouge habite ces secteurs.\nMise à jour : janvier 2024","Dans la MRC d’Argenteuil, les secteurs ayant les conditions parmi les plus défavorables de la MRC à la fois sur le plan matériel et social (profil 5) sont tous localisés à Lachute. Près du tiers de la population de Lachute habite ces secteurs.\n\nLes secteurs où les conditions sont les parmi les plus défavorables de la MRC sur le plan social uniquement (profil 3) se retrouvent à Grenville, Lachute et à Brownsburg-Chatham. L’ensemble de la population de Grenville réside dans ces secteurs.\n\nOn retrouve des secteurs qui présentent les conditions parmi les plus défavorables de la MRC seulement sur le plan matériel (profil 4) à Brownsburg-Chatham, Grenville-sur-la-Rouge et à Lachute. Environ un quart des résidents de Brownsburg-Chatham et de Grenville-sur-la Rouge habite ces secteurs.\n\nMise à jour : janvier 2024",null,"J3:O40","A20:K35","Répartition de la population selon les profils de défavorisation matérielle et sociale combinée 2021 de la MRC d'Argenteuil","Source : INSPQ et BIESP, 2023. Statistique Canada, Recensement 2021.","A16","49.5","Population des secteurs ayant les conditions matérielles et sociales les plus défavorables de la MRC d'Argenteuil, 2021","Panorama de la défavorisation dans les Laurentides 2021, produit par l’équipe Surveillance, recherche et évaluation, Direction de santé publique des Laurentides, Centre intégré de santé et de services sociaux des Laurentides, 2024","A17","La population sans indice réside dans des secteurs où l’information pour le calcul de l’indice est indisponible à cause des ménages collectifs (centres d’hébergement, pénitenciers) ou du taux de non-réponse trop élevé.","A18","https://www.santelaurentides.gouv.qc.ca/sante-publique/donnees-sur-la-population/panorama-de-la-defavorisation/","A1:O18","A1:O17","Répartition de la population selon les profils de défavorisation matérielle et sociale combinée 2021 de la MRC d'Argenteuil","Dans la MRC d’Argenteuil, les secteurs ayant les conditions parmi les plus défavorables de la MRC à la fois sur le plan matériel et social (profil 5) sont tous localisés à Lachute. Près du tiers de la population de Lachute habite ces secteurs.\n\nMise à jour : janvier 2024"]
[760,"760MatérielleLocal","Local","Matérielle","A304:K313","A23:J25","F304:G313","A28:B30","A304:A313","MRC_Argenteuil_Defavo_2016_Mat.png","MRC_ARG_2016_Mat","A5","B2","B5","B2","A5","Dans la MRC d’Argenteuil, on retrouve des secteurs ayant les conditions matérielles parmi les plus défavorables (quartile 4 – en orangé) de la MRC à Lachute, Brownsburg-Chatham et Grenville-sur-la-Rouge. Près de la moitié des résidents de Lachute habite ces secteurs, comme environ le quart de ceux de Brownsburg-Chatham et de Grenville-sur-la Rouge.\n\nMise à jour : janvier 2024","Dans la MRC d’Argenteuil, on retrouve des secteurs ayant les conditions matérielles parmi les plus défavorables (quartile 4) de la MRC à Lachute, Brownsburg-Chatham et Grenville-sur-la-Rouge.  Près de la moitié des résidents de Lachute habite ces secteurs, comme environ le quart de ceux de Brownsburg-Chatham et de Grenville-sur-la Rouge.\n\nMise à jour : janvier 2024",null,"J3:O40","A19:K34","Répartition de la population selon le niveau de défavorisation matérielle 2021 de la MRC d'Argenteuil","Source : INSPQ et BIESP, 2023. Statistique Canada, Recensement 2021.","A15","16.5","Population des secteurs ayant les conditions matérielles les plus défavorables de la MRC d'Argenteuil, 2021","Panorama de la défavorisation dans les Laurentides 2021, produit par l’équipe Surveillance, recherche et évaluation, Direction de santé publique des Laurentides, Centre intégré de santé et de services sociaux des Laurentides, 2024","A16","La population sans indice réside dans des secteurs où l’information pour le calcul de l’indice est indisponible à cause des ménages collectifs (centres d’hébergement, pénitenciers) ou du taux de non-réponse trop élevé.","A17","https://www.santelaurentides.gouv.qc.ca/sante-publique/donnees-sur-la-population/panorama-de-la-defavorisation/","A1:O17","A1:O16","Répartition de la population selon le niveau de défavorisation matérielle 2021 de la MRC d'Argenteuil","Dans la MRC d’Argenteuil, on retrouve des secteurs ayant les conditions matérielles parmi les plus défavorables (quartile 4) de la MRC à Lachute, Brownsburg-Chatham et Grenville-sur-la-Rouge.  Près de la moitié des résidents de Lachute habite ces secteurs, comme environ le quart de ceux de Brownsburg-Chatham et de Grenville-sur-la Rouge.\n\nMise à jour : janvier 2024"]
[760,"760SocialeLocal","Local","Sociale","A395:K404","A23:J25","F395:G404","A28:B30","A395:A404","MRC_Argenteuil_Defavo_2016_Soc.png","MRC_ARG_2016_Soc","A5","B2","B5","B2","A5","Dans la MRC d’Argenteuil, les secteurs ayant les conditions sociales parmi les plus défavorables (quartile 4 – en orangé) de la MRC se répartissent dans Grenville, Lachute et Brownsburg-Chatham. Près de la moitié de la population de Lachute et l’ensemble de la population de Grenville habite ces secteurs. \n\nMise à jour : janvier 2024","Dans la MRC d’Argenteuil, les secteurs ayant les conditions sociales parmi les plus défavorables (quartile 4) de la MRC se répartissent dans Grenville, Lachute et Brownsburg-Chatham. Près de la moitié de la population de Lachute et l’ensemble de la population de Grenville habitent ces secteurs. \n\nMise à jour : janvier 2024",null,"J3:O40","A19:K34","Répartition de la population selon le niveau de défavorisation sociale 2021 de la MRC d'Argenteuil","Source : INSPQ et BIESP, 2023. Statistique Canada, Recensement 2021.","A15","16.5","Population des secteurs ayant les conditions sociales les plus défavorables de la MRC d'Argenteuil, 2021","Panorama de la défavorisation dans les Laurentides 2021, produit par l’équipe Surveillance, recherche et évaluation, Direction de santé publique des Laurentides, Centre intégré de santé et de services sociaux des Laurentides, 2024","A16","La population sans indice réside dans des secteurs où l’information pour le calcul de l’indice est indisponible à cause des ménages collectifs (centres d’hébergement, pénitenciers) ou du taux de non-réponse trop élevé.","A17","https://www.santelaurentides.gouv.qc.ca/sante-publique/donnees-sur-la-population/panorama-de-la-defavorisation/","A1:O17","A1:O16","Répartition de la population selon le niveau de défavorisation sociale 2021 de la MRC d'Argenteuil","Dans la MRC d’Argenteuil, les secteurs ayant les conditions sociales parmi les plus défavorables (quartile 4) de la MRC se répartissent dans Grenville, Lachute et Brownsburg-Chatham. Près de la moitié de la population de Lachute et l’ensemble de la population de Grenville habitent ces secteurs. \n\nMise à jour : janvier 2024"]
[770,"770Matérielle et socialeLocal","Local","Matérielle et sociale","A41:O51","A1:N4","J41:K51","A12:B15","A41:A51","MRC_PaysEnHaut_Defavo_2016_Comb.png","MRC_PDH_2016_Comb","A6","B2","B6","B2","A6","Dans la MRC des Pays-d’en-Haut, les secteurs ayant les conditions parmi les plus défavorables de la MRC à la fois sur le plan matériel et social (profil 5 – en violet) sont localisés à Sainte-Adèle. \n\nLes secteurs où les conditions sont parmi les plus défavorables de la MRC uniquement sur le plan social (profil 3 – en bleu) se retrouvent à Sainte-Adèle, Piedmont et à Saint-Sauveur. Plus des trois-quarts de la population de Piedmont habitent ces secteurs.\n\nOn retrouve des secteurs qui présentent les conditions parmi les plus défavorables de la MRC seulement sur le plan matériel (profil 4 – en orangé) dans Sainte-Marguerite-du-Lac-Masson, Sainte-Adèle, Wentworth-Nord, Saint-Adolphe-d’Howard et Saint-Sauveur. Presque toute la population de Sainte-Marguerite-du-Lac-Masson et plus de la moitié de celle de Saint-Adolphe-d'Howard habitent ces secteurs.\n\nMise à jour : janvier 2024","Dans la MRC des Pays-d’en-Haut, les secteurs ayant les conditions parmi les plus défavorables de la MRC à la fois sur le plan matériel et social (profil 5) sont localisés à Sainte-Adèle. \n\nLes secteurs où les conditions sont parmi les plus défavorables de la MRC uniquement sur le plan social (profil 3) se retrouvent à Sainte-Adèle, Piedmont et à Saint-Sauveur. Plus des trois-quarts de la population de Piedmont habitent ces secteurs.\n\nOn retrouve des secteurs qui présentent les conditions parmi les plus défavorables de la MRC seulement sur le plan matériel (profil 4) dans Sainte-Marguerite-du-Lac-Masson, Sainte-Adèle, Wentworth-Nord, Saint-Adolphe-d’Howard et Saint-Sauveur. Presque toute la population de Sainte-Marguerite-du-Lac-Masson et plus de la moitié de celle de Saint-Adolphe-d'Howard habitent ces secteurs.\n\nMise à jour : janvier 2024",null,"J3:O40","A21:K36","Répartition de la population selon les profils de défavorisation matérielle et sociale combinée 2021 de la MRC des Pays-d'en-Haut","Source : INSPQ et BIESP, 2023. Statistique Canada, Recensement 2021.","A17","49.5","Population des secteurs ayant les conditions matérielles et sociales les plus défavorables de la MRC des Pays-d'en-Haut, 2021","Panorama de la défavorisation dans les Laurentides 2021, produit par l’équipe Surveillance, recherche et évaluation, Direction de santé publique des Laurentides, Centre intégré de santé et de services sociaux des Laurentides, 2024","A18","La population sans indice réside dans des secteurs où l’information pour le calcul de l’indice est indisponible à cause des ménages collectifs (centres d’hébergement, pénitenciers) ou du taux de non-réponse trop élevé.","A19","https://www.santelaurentides.gouv.qc.ca/sante-publique/donnees-sur-la-population/panorama-de-la-defavorisation/","A1:O18","A1:O17","Répartition de la population selon les profils de défavorisation matérielle et sociale combinée 2021 de la MRC des Pays-d'en-Haut","Dans la MRC des Pays-d’en-Haut, les secteurs ayant les conditions parmi les plus défavorables de la MRC à la fois sur le plan matériel et social (profil 5) sont localisés à Sainte-Adèle. \n\nMise à jour : janvier 2024"]
[770,"770MatérielleLocal","Local","Matérielle","A314:K324","A23:J25","F314:G324","A28:B30","A314:A324","MRC_PaysEnHaut_Defavo_2016_Mat.png","MRC_PDH_2016_Mat","A5","B2","B5","B2","A5","Dans la MRC des Pays-d’en-Haut, les secteurs ayant les conditions matérielles parmi les plus défavorables (quartile 4 – en orangé) de la MRC sont à Sainte-Marguerite-du-Lac-Masson, Sainte-Adèle, Wentworth-Nord, Saint-Adolphe-d’Howard et Saint-Sauveur. Presque toute la population de Sainte-Marguerite-du-Lac-Masson et plus de la moitié de celle de Saint-Adolphe-d'Howard habitent ces secteurs. \n\nMise à jour : janvier 2024","Dans la MRC des Pays-d’en-Haut, les secteurs ayant les conditions matérielles parmi les plus défavorables (quartile 4) de la MRC sont Sainte-Marguerite-du-Lac-Masson, Sainte-Adèle, Wentworth-Nord, Saint-Adolphe-d’Howard et Saint-Sauveur. Presque toute la population de Sainte-Marguerite-du-Lac-Masson et plus de la moitié de celle de Saint-Adolphe-d'Howard habitent ces secteurs. \n\nMise à jour : janvier 2024",null,"J3:O40","A20:K35","Répartition de la population selon le niveau de défavorisation matérielle 2021 de la MRC des Pays-d'en-Haut","Source : INSPQ et BIESP, 2023. Statistique Canada, Recensement 2021.","A16","16.5","Population des secteurs ayant les conditions matérielles les plus défavorables de la MRC des Pays-d'en-Haut, 2021","Panorama de la défavorisation dans les Laurentides 2021, produit par l’équipe Surveillance, recherche et évaluation, Direction de santé publique des Laurentides, Centre intégré de santé et de services sociaux des Laurentides, 2024","A17","La population sans indice réside dans des secteurs où l’information pour le calcul de l’indice est indisponible à cause des ménages collectifs (centres d’hébergement, pénitenciers) ou du taux de non-réponse trop élevé.","A18","https://www.santelaurentides.gouv.qc.ca/sante-publique/donnees-sur-la-population/panorama-de-la-defavorisation/","A1:O17","A1:O16","Répartition de la population selon le niveau de défavorisation matérielle 2021 de la MRC des Pays-d'en-Haut","Dans la MRC des Pays-d’en-Haut, les secteurs ayant les conditions matérielles parmi les plus défavorables (quartile 4) de la MRC sont à Sainte-Marguerite-du-Lac-Masson, Sainte-Adèle, Wentworth-Nord, Saint-Adolphe-d’Howard et à Saint-Sauveur. Presque toute la population de Sainte-Marguerite-du-Lac-Masson et plus de la moitié de celle de Saint-Adolphe-d'Howard habitent ces secteurs. \n\nMise à jour : janvier 2024"]
[770,"770SocialeLocal","Local","Sociale","A405:K415","A23:J25","F405:G415","A28:B30","A405:A415","MRC_PaysEnHaut_Defavo_2016_Soc.png","MRC_PDH_2016_Soc","A5","B2","B5","B2","A5","Les secteurs de la MRC des Pays-d’en-Haut qui présentent les conditions sociales parmi les plus défavorables (quartile 4 – en orangé) de la MRC se retrouvent à Sainte-Adèle, Piedmont et à Saint-Sauveur. Plus des trois-quarts de la population de Piedmont et près de la moitié de celle de Sainte-Adèle habitent ces secteurs.\n\nMise à jour : janvier 2024","Les secteurs de la MRC des Pays-d’en-Haut qui présentent les conditions sociales parmi les plus défavorables (quartile 4) de la MRC se retrouvent à Sainte-Adèle, Piedmont et à Saint-Sauveur. Plus des trois-quarts de la population de Piedmont et près de la moitié de celle de Sainte-Adèle habitent ces secteurs.\n\nMise à jour : janvier 2024",null,"J3:O40","A20:K35","Répartition de la population selon le niveau de défavorisation sociale 2021 de la MRC des Pays-d'en-Haut","Source : INSPQ et BIESP, 2023. Statistique Canada, Recensement 2021.","A16","16.5","Population des secteurs ayant les conditions sociales les plus défavorables de la MRC des Pays-d'en-Haut, 2021","Panorama de la défavorisation dans les Laurentides 2021, produit par l’équipe Surveillance, recherche et évaluation, Direction de santé publique des Laurentides, Centre intégré de santé et de services sociaux des Laurentides, 2024","A17","La population sans indice réside dans des secteurs où l’information pour le calcul de l’indice est indisponible à cause des ménages collectifs (centres d’hébergement, pénitenciers) ou du taux de non-réponse trop élevé.","A18","https://www.santelaurentides.gouv.qc.ca/sante-publique/donnees-sur-la-population/panorama-de-la-defavorisation/","A1:O17","A1:O16","Répartition de la population selon le niveau de défavorisation sociale 2021 de la MRC des Pays-d'en-Haut","Les secteurs de la MRC des Pays-d’en-Haut qui présentent les conditions sociales parmi les plus défavorables (quartile 4) de la MRC se retrouvent à Sainte-Adèle, Piedmont et à Saint-Sauveur. Plus des trois-quarts de la population de Piedmont et près de la moitié de celle de Sainte-Adèle habitent ces secteurs. Mise à jour : janvier 2024"]
[780,"780Matérielle et socialeLocal","Local","Matérielle et sociale","A52:O72","A1:N4","J52:K72","A12:B15","A52:A72","MRC_Laurentides_Defavo_2016_Comb.png","MRC_LAUR_2016_Comb","A6","B2","B6","B2","A6","Dans la MRC des Laurentides, on retrouve des secteurs ayant les conditions parmi les plus défavorables de la MRC à la fois sur le plan matériel et social (profil 5 – en violet) à Sainte-Agathe-des-Monts et à Mont-Tremblant. À Sainte-Agathe-des-Monts, près du quart de la population habite dans ces secteurs.\n\nLes secteurs où les conditions sont parmi les plus défavorables de la MRC uniquement sur le plan social (profil 3 – en bleu) se situent à Val-Morin, Val-David, Sainte-Agathe-des-Monts, Mont-Blanc, Arundel et Mont-Tremblant. C’est à Mont-Tremblant et à Val-David qu’on retrouve le plus grand nombre de personnes qui résident dans ces secteurs. L’ensemble de la population d’Arundel habite ces secteurs. \n\nLes secteurs qui présentent les conditions parmi les plus défavorables de la MRC seulement sur le plan matériel (profil 4 – en orangé) se situent à Sainte-Agathe-des-Monts, Sainte-Lucie-des-Laurentides, Montcalm, Huberdeau, Lac-Supérieur, Lanthier, Mont-Tremblant, Mont-Blanc, Amherst, Labelle et à La Conception. L’ensemble de la population Amherst et de Lanthier habite ces secteurs.\n\nMise à jour : janvier 2024","Dans la MRC des Laurentides, on retrouve des secteurs ayant les conditions parmi les plus défavorables de la MRC à la fois sur le plan matériel et social (profil 5) à Sainte-Agathe-des-Monts et à Mont-Tremblant. À Sainte-Agathe-des-Monts, près du quart de la population habite dans ces secteurs.\n\nLes secteurs où les conditions sont parmi les plus défavorables de la MRC uniquement sur le plan social (profil 3) se situent à Val-Morin, Val-David, Sainte-Agathe-des-Monts, Mont-Blanc, Arundel et Mont-Tremblant. C’est à Val-David, Mont-Tremblant et à Val-David qu’on retrouve le plus grand nombre de personnes qui résident dans ces secteurs. L’ensemble de la population d’Arundel habitent ces secteurs. \n\nLes secteurs qui présentent les conditions parmi les plus défavorables de la MRC seulement sur le plan matériel (profil 4) se situent à Sainte-Agathe-des-Monts, Sainte-Lucie-des-Laurentides, Montcalm, Huberdeau, Lac-Supérieur, Lanthier, Mont-Tremblant, Mont-Blanc, Amherst, Labelle et à La Conception. L’ensemble de la population d’Amherst et de Lanthier habite ces secteurs.\n\nMise à jour : janvier 2024",null,"J3:O40","A31:K45","Répartition de la population selon les profils de défavorisation matérielle et sociale combinée 2021 de la MRC des Laurentides","Source : INSPQ et BIESP, 2023. Statistique Canada, Recensement 2021.","A27","49.5","Population des secteurs ayant les conditions matérielles et sociales les plus défavorables de la MRC des Laurentides, 2021","Panorama de la défavorisation dans les Laurentides 2021, produit par l’équipe Surveillance, recherche et évaluation, Direction de santé publique des Laurentides, Centre intégré de santé et de services sociaux des Laurentides, 2024","A28","La population sans indice réside dans des secteurs où l’information pour le calcul de l’indice est indisponible à cause des ménages collectifs (centres d’hébergement, pénitenciers) ou du taux de non-réponse trop élevé.","A29","https://www.santelaurentides.gouv.qc.ca/sante-publique/donnees-sur-la-population/panorama-de-la-defavorisation/","A1:O29","A1:O28","Répartition de la population selon les profils de défavorisation matérielle et sociale combinée 2021 de la MRC des Laurentides","Dans la MRC des Laurentides, on retrouve des secteurs ayant les conditions parmi les plus défavorables de la MRC à la fois sur le plan matériel et social (profil 5) à Sainte-Agathe-des-Monts et à Mont-Tremblant. À Sainte-Agathe-des-Monts, près du quart de la population habite dans ces secteurs.\n\nMise à jour : janvier 2024"]
[780,"780MatérielleLocal","Local","Matérielle","A325:K345","A23:J25","F325:G345","A28:B30","A325:A345","MRC_Laurentides_Defavo_2016_Mat.png","MRC_LAUR_2016_Mat","A5","B2","B5","B2","A5","Dans la MRC des Laurentides, les secteurs ayant les conditions matérielles parmi les plus défavorables (quartile 4 – en orangé) de la MRC sont localisés à Sainte-Agathe-des-Monts, Sainte-Lucie-des-Laurentides, Huberdeau, Lac-Supérieur, Lanthier, Mont-Tremblant, Mont-Blanc, Amherst, Labelle et à La Conception. En nombre de personnes, Sainte-Agathe-des-Monts est de loin la municipalité où la population habitant ces secteurs est la plus importante. \n\nMise à jour : janvier 2024","Dans la MRC des Laurentides, les secteurs ayant les conditions matérielles parmi les plus défavorables (quartile 4) de la MRC sont localisés à Sainte-Agathe-des-Monts, Sainte-Lucie-des-Laurentides, Huberdeau, Lac-Supérieur, Lanthier, Mont-Tremblant, Mont-Blanc, Amherst, Labelle et à La Conception. En nombre de personnes, Sainte-Agathe-des-Monts est de loin la municipalité où la population habitant ces secteurs est la plus importante. \n\nMise à jour : janvier 2024",null,"J3:O40","A30:K44","Répartition de la population selon le niveau de défavorisation matérielle 2021 de la MRC des Laurentides","Source : INSPQ et BIESP, 2023. Statistique Canada, Recensement 2021.","A26","16.5","Population des secteurs ayant les conditions matérielles les plus défavorables de la MRC des Laurentides, 2021","Panorama de la défavorisation dans les Laurentides 2021, produit par l’équipe Surveillance, recherche et évaluation, Direction de santé publique des Laurentides, Centre intégré de santé et de services sociaux des Laurentides, 2024","A27","La population sans indice réside dans des secteurs où l’information pour le calcul de l’indice est indisponible à cause des ménages collectifs (centres d’hébergement, pénitenciers) ou du taux de non-réponse trop élevé.","A28","https://www.santelaurentides.gouv.qc.ca/sante-publique/donnees-sur-la-population/panorama-de-la-defavorisation/","A1:O28","A1:O27","Répartition de la population selon le niveau de défavorisation matérielle 2021 de la MRC des Laurentides","Dans la MRC des Laurentides, les secteurs ayant les conditions matérielles parmi les plus défavorables (quartile 4) de la MRC sont localisés à Sainte-Agathe-des-Monts, Sainte-Lucie-des-Laurentides, Huberdeau, Lac-Supérieur, Lanthier, Mont-Tremblant, Mont-Blanc, Amherst, Labelle et à La Conception. En nombre de personnes, Sainte-Agathe-des-Monts est de loin la municipalité où la population habitant ces secteurs est la plus importante. \n\nMise à jour : janvier 2024"]
[780,"780SocialeLocal","Local","Sociale","A416:K436","A23:J25","F416:G436","A28:B30","A416:A436","MRC_Laurentides_Defavo_2016_Soc.png","MRC_LAUR_2016_Soc","A5","B2","B5","B2","A5","Dans la MRC des Laurentides, les secteurs ayant les conditions sociales parmi les plus défavorables (quartile 4 – en orangé) de la MRC sont localisés à Sainte-Agathe-des-Monts, Mont-Blanc, Barkmere, Arundel, Mont-Tremblant, Val-David et à Val-Morin. En nombre de personnes, Mont-Tremblant est la municipalité où la population habitant ces secteurs est la plus importante, suivie par Sainte-Agathe-des-Monts et Val-David. \n\nMise à jour : janvier 2024","Dans la MRC des Laurentides, les secteurs ayant les conditions sociales parmi les plus défavorables (quartile 4) de la MRC sont localisés à Sainte-Agathe-des-Monts, Mont-Blanc, Barkmere, Arundel, Mont-Tremblant, Val-David et à Val-Morin. En nombre de personnes, Mont-Tremblant est la municipalité où la population habitant ces secteurs est la plus importante, suivie par Sainte-Agathe-des-Monts et Val-David. \n\nMise à jour : janvier 2024",null,"J3:O40","A30:K44","Répartition de la population selon le niveau de défavorisation sociale 2021 de la MRC des Laurentides","Source : INSPQ et BIESP, 2023. Statistique Canada, Recensement 2021.","A26","16.5","Population des secteurs ayant les conditions sociales les plus défavorables de la MRC des Laurentides, 2021","Panorama de la défavorisation dans les Laurentides 2021, produit par l’équipe Surveillance, recherche et évaluation, Direction de santé publique des Laurentides, Centre intégré de santé et de services sociaux des Laurentides, 2024","A27","La population sans indice réside dans des secteurs où l’information pour le calcul de l’indice est indisponible à cause des ménages collectifs (centres d’hébergement, pénitenciers) ou du taux de non-réponse trop élevé.","A28","https://www.santelaurentides.gouv.qc.ca/sante-publique/donnees-sur-la-population/panorama-de-la-defavorisation/","A1:O28","A1:O27","Répartition de la population selon le niveau de défavorisation sociale 2021 de la MRC des Laurentides","Dans la MRC des Laurentides, les secteurs ayant les conditions sociales parmi les plus défavorables (quartile 4) de la MRC sont localisés à Sainte-Agathe-des-Monts, Mont-Blanc, Barkmere, Arundel, Mont-Tremblant, Val-David et Val-Morin. En nombre de personnes, Mont-Tremblant est la municipalité où la population habitant ces secteurs est la plus importante, suivie par Sainte-Agathe-des-Monts et Val-David. \n\nMise à jour : janvier 2024"]
[790,"790Matérielle et socialeLocal","Local","Matérielle et sociale","A73:O91","A1:N4","J73:K91","A12:B15","A73:A91","MRC_Antoine-Labelle_Defavo_2016_Comb.png","MRC_AL_2016_Comb","A6","B2","B6","B2","A6","Dans la MRC d’Antoine-Labelle, les secteurs ayant les conditions parmi les plus défavorables de la MRC à la fois sur le plan matériel et social (profil 5 – en violet) sont localisés à Rivière-Rouge, à Nominingue, à Lac-des-Écorces, à Ferme-Neuve et à Mont-Laurier.\n\nLes secteurs ayant les conditions parmi les plus défavorables de la MRC sur le plan social uniquement (profil 3 – en bleu) se retrouvent à Rivière-Rouge, La Macaza, Lac-des-Écorces et Mont-Laurier. Celle-ci est de loin la municipalité où la taille de la population habitant ces secteurs est la plus importante.\n\nOn retrouve des secteurs ayant les conditions parmi les plus défavorables de la MRC sur le plan matériel seulement (profil 4 – en orangé) à Notre-Dame-de-Pontmain, L’Ascension, Lac-des-Écorces, Mont-Laurier, Ferme-Neuve, Chute-Saint-Philippe, Lac-du-Cerf et Mont-Saint-Michel. L’ensemble des populations de Notre-Dame-de-Pontmain, Mont-Saint-Michel et Lac-du-Cerf habitent ces secteurs. \n\nMise à jour : janvier 2024","Dans la MRC d’Antoine-Labelle, les secteurs ayant les conditions parmi les plus défavorables de la MRC à la fois sur le plan matériel et social (profil 5) sont localisés à Rivière-Rouge, Nominingue, Lac-des-Écorces, Ferme-Neuve et à Mont-Laurier.\n\nLes secteurs ayant les conditions parmi les plus défavorables de la MRC sur le plan social uniquement (profil 3) se retrouvent à Rivière-Rouge, La Macaza, Lac-des-Écorces et Mont-Laurier. Celle-ci est de loin la municipalité où la taille de la population habitant ces secteurs est la plus importante.\n\nOn retrouve des secteurs ayant les conditions parmi les plus défavorables de la MRC sur le plan matériel seulement (profil 4) à Notre-Dame-de-Pontmain, L’Ascension, Lac-des-Écorces, Mont-Laurier, Ferme-Neuve, Chute-Saint-Philippe, Lac-du-Cerf et Mont-Saint-Michel. L’ensemble des populations de Notre-Dame-de-Pontmain, Mont-Saint-Michel et Lac-du-Cerf habitent ces secteurs. \n\nMise à jour : janvier 2024",null,"J3:O40","A29:K43","Répartition de la population selon les profils de défavorisation matérielle et sociale combinée 2021 de la MRC d'Antoine-Labelle","Source : INSPQ et BIESP, 2023. Statistique Canada, Recensement 2021.","A25","49.5","Population des secteurs ayant les conditions matérielles et sociales les plus défavorables de la MRC d'Antoine-Labelle, 2021","Panorama de la défavorisation dans les Laurentides 2021, produit par l’équipe Surveillance, recherche et évaluation, Direction de santé publique des Laurentides, Centre intégré de santé et de services sociaux des Laurentides, 2024","A26","La population sans indice réside dans des secteurs où l’information pour le calcul de l’indice est indisponible à cause des ménages collectifs (centres d’hébergement, pénitenciers) ou du taux de non-réponse trop élevé.","A27","https://www.santelaurentides.gouv.qc.ca/sante-publique/donnees-sur-la-population/panorama-de-la-defavorisation/","A1:O27","A1:O26","Répartition de la population selon les profils de défavorisation matérielle et sociale combinée 2021 de la MRC d'Antoine-Labelle","Dans la MRC d’Antoine-Labelle, les secteurs ayant les conditions parmi les plus défavorables de la MRC à la fois sur le plan matériel et social (profil 5) sont localisés à Rivière-Rouge, Nominingue, Lac-des-Écorces, Ferme-Neuve et à Mont-Laurier.\n\nMise à jour : janvier 2024 "]
[790,"790MatérielleLocal","Local","Matérielle","A346:K364","A23:J25","F346:G364","A28:B30","A346:A364","MRC_Antoine-Labelle_Defavo_2016_Mat.png","MRC_AL_2016_Mat","A5","B2","B5","B2","A5","Dans la MRC d’Antoine-Labelle, on retrouve les secteurs ayant les conditions matérielles parmi les plus défavorables (quartile 4) de la MRC à Notre-Dame-de-Pontmain, L’Ascension, Lac-des-Écorces, Mont-Laurier, Ferme-Neuve, Chute-Saint-Philippe, Lac-du-Cerf, Rivière-Rouge, Nominingue et Mont-Saint-Michel. En nombre de personnes, Mont-Laurier et Ferme-Neuve sont les municipalités où les populations habitant ces secteurs sont les plus importantes.\n\nMise à jour : janvier 2024","Dans la MRC d’Antoine-Labelle, on retrouve les secteurs ayant les conditions matérielles parmi les plus défavorables (quartile 4) de la MRC à Notre-Dame-de-Pontmain, L’Ascension, Lac-des-Écorces, Mont-Laurier, Ferme-Neuve, Chute-Saint-Philippe, Lac-du-Cerf, Rivière-Rouge, Nominingue et Mont-Saint-Michel. En nombre de personnes, Mont-Laurier, Ferme-Neuve et Lac-des-Écorces sont les municipalités où les populations habitant ces secteurs sont les plus importantes.\n\nMise à jour : janvier 2024",null,"J3:O40","A28:K42","Répartition de la population selon le niveau de défavorisation matérielle 2021 de la MRC d'Antoine-Labelle","Source : INSPQ et BIESP, 2023. Statistique Canada, Recensement 2021.","A24","16.5","Population des secteurs ayant les conditions matérielles les plus défavorables de la MRC d'Antoine-Labelle, 2021","Panorama de la défavorisation dans les Laurentides 2021, produit par l’équipe Surveillance, recherche et évaluation, Direction de santé publique des Laurentides, Centre intégré de santé et de services sociaux des Laurentides, 2024","A25","La population sans indice réside dans des secteurs où l’information pour le calcul de l’indice est indisponible à cause des ménages collectifs (centres d’hébergement, pénitenciers) ou du taux de non-réponse trop élevé.","A26","https://www.santelaurentides.gouv.qc.ca/sante-publique/donnees-sur-la-population/panorama-de-la-defavorisation/","A1:O26","A1:O25","Répartition de la population selon le niveau de défavorisation matérielle 2021 de la MRC d'Antoine-Labelle","Dans la MRC d’Antoine-Labelle, on retrouve les secteurs ayant les conditions matérielles parmi les plus défavorables (quartile 4) de la MRC à Notre-Dame-de-Pontmain, L’Ascension, Lac-des-Écorces, Mont-Laurier, Ferme-Neuve, Chute-Saint-Philippe, Lac-du-Cerf, Rivière-Rouge, Nominingue et Mont-Saint-Michel. En nombre de personnes, Mont-Laurier et Ferme-Neuve sont les municipalités où les populations habitant ces secteurs sont les plus importantes.\n\nMise à jour : janvier 2024"]
[790,"790SocialeLocal","Local","Sociale","A437:K455","A23:J25","F437:G455","A28:B30","A437:A455","MRC_Antoine-Labelle_Defavo_2016_Soc.png","MRC_AL_2016_Soc","A5","B2","B5","B2","A5","Dans la MRC d’Antoine-Labelle, on retrouve les secteurs ayant les conditions sociales parmi les plus défavorables (quartile 4) à Rivière-Rouge, La Macaza, Sainte-Anne-du-Lac, Nominingue, Mont-Laurier, Ferme-Neuve, Lac-des-Écorces, et Mont-Laurier. En nombre de personnes, Mont-Laurier est de loin la municipalité où la population habitant ces secteurs est la plus importante.\n\nMise à jour : janvier 2024","Dans la MRC d’Antoine-Labelle, on retrouve les secteurs ayant les conditions sociales parmi les plus défavorables (quartile 4) à Rivière-Rouge, La Macaza, Sainte-Anne-du-Lac, Nominingue, Mont-Laurier, Ferme-Neuve, Lac-des-Écorces, et Mont-Laurier. En nombre de personnes, Mont-Laurier est de loin la municipalité où la population habitant ces secteurs est la plus importante.\n\nMise à jour : janvier 2024",null,"J3:O40","A28:K42","Répartition de la population selon le niveau de défavorisation sociale 2021 de la MRC d'Antoine-Labelle","Source : INSPQ et BIESP, 2023. Statistique Canada, Recensement 2021.","A24","16.5","Population des secteurs ayant les conditions sociales les plus défavorables de la MRC d'Antoine-Labelle, 2021","Panorama de la défavorisation dans les Laurentides 2021, produit par l’équipe Surveillance, recherche et évaluation, Direction de santé publique des Laurentides, Centre intégré de santé et de services sociaux des Laurentides, 2024","A25","La population sans indice réside dans des secteurs où l’information pour le calcul de l’indice est indisponible à cause des ménages collectifs (centres d’hébergement, pénitenciers) ou du taux de non-réponse trop élevé.","A26","https://www.santelaurentides.gouv.qc.ca/sante-publique/donnees-sur-la-population/panorama-de-la-defavorisation/","A1:O26","A1:O25","Répartition de la population selon le niveau de défavorisation sociale 2021 de la MRC d'Antoine-Labelle","Dans la MRC d’Antoine-Labelle, on retrouve les secteurs ayant les conditions sociales parmi les plus défavorables (quartile 4) à Rivière-Rouge, La Macaza, Sainte-Anne-du-Lac, Nominingue, Mont-Laurier, Ferme-Neuve, Lac-des-Écorces, et Mont-Laurier. En nombre de personnes, Mont-Laurier est de loin la municipalité où la population habitant ces secteurs est la plus importante.\n\nMise à jour : janvier 2024"]
[720,"720Matérielle et socialeRégional","Régional","Matérielle et sociale","A462:O470","A1:N4","J462:K470","A12:B15","A462:A470","MRC_DeuxMontagnes_Defavo_2016_Comb.png","MRC_DM_2016_Comb_Quintile","A6","B2","B6","B2","A6","Dans la MRC de Deux-Montagnes, les secteurs ayant des conditions parmi les plus défavorables de la MRC à la fois sur le plan matériel et social (profil 5 – en violet) sont localisés à Pointe-Calumet, Sainte-Marthe-sur-le-Lac, Deux-Montagnes et à Saint-Eustache.\n\nLes secteurs où les conditions sont les plus défavorables de la MRC seulement sur le plan social (profil 3 – en bleu) se retrouvent dans toutes les municipalités de la MRC, SAUF à Saint-Placide (à noter qu’il s’agit de très petits secteurs dans Oka et Pointe-Calumet).\n\nOn retrouve des secteurs qui présentent les conditions les plus défavorables de la MRC seulement sur le plan matériel (profil 4 – en orangé) dans toutes les municipalités du territoire. Plus de la moitié de la population de Pointe-Calumet et près de la moitié de celle de Saint-Joseph-du-Lac résident dans ces secteurs.\n\nMise à jour : janvier 2024","Plus d’un résident sur dix de la MRC de Deux-Montagnes habitent un secteur ayant des conditions parmi les plus défavorables à la fois sur le plan matériel et social (profil 5). Ces secteurs sont localisés à Deux-Montagnes, Pointe-Calumet, Saint-Eustache et à Sainte-Marthe-sur-le-Lac. À Pointe-Calumet, plus du tiers de la population habite dans ces secteurs.\n\nEnviron un cinquième de la population de la MRC habitent des secteurs où les conditions sont parmi les plus défavorables seulement sur le plan social (profil 3). On retrouve de ces secteurs dans toutes les municipalités SAUF Saint-Placide. Pointe-Calumet compte moins d’un résident sur dix qui habite un secteur de profil 3. Plus du tiers de la population de la municipalité de Deux-Montagnes habite dans ces secteurs.\n\nEnviron un cinquième de la population de la MRC habitent des secteurs où les conditions sont parmi les plus défavorables seulement sur le plan matériel (profil 4). Ces derniers se retrouvent dans toutes les municipalités du territoire. Plus de la moitié de la population de Saint-Placide et de Pointe-Calumet réside dans ces secteurs.\n\nMise à jour : janvier 2024","Lorsqu’on se concentre sur l’évolution des secteurs du profil 5 (violet), soit ceux ayant les conditions matérielles et sociales les plus défavorables, on remarque peu de changement en 2021 par rapport à 2016. Certains secteurs de profil 5 se sont ajoutés à Sainte-Marthe-sur-le-Lac, Deux-Montagnes et Saint-Eustache. D’autres sont passés à un profil plus favorable dans ces trois mêmes municipalités, ainsi qu’à Saint-Placide.\n\nÀ savoir - Les variations entre 2016 et 2021 ont plusieurs causes possibles. Elles peuvent être dues à des changements 1) dans la population des secteurs auxquels on réfère, 2) dans la population de l’ensemble du territoire auquel les secteurs sont comparés, ou encore 3) dans la compilation de l’indice, en raison, par exemple, des modifications du découpage des secteurs ou des données manquantes. \n\nMise à jour : février 2024","J3:O40","A19:K34","Répartition de la population selon les profils de défavorisation matérielle et sociale combinée 2021 de la région des Laurentides - secteur MRC de Deux-Montagnes","Source : INSPQ et BIESP, 2023. Statistique Canada, Recensement 2021.","A15","49.5","Population des secteurs ayant les conditions matérielles et sociales les plus défavorables - secteur de Deux-Montagnes, 2021","Panorama de la défavorisation dans les Laurentides 2021, produit par l’équipe Surveillance, recherche et évaluation, Direction de santé publique des Laurentides, Centre intégré de santé et de services sociaux des Laurentides, 2024","A16","La population sans indice réside dans des secteurs où l’information pour le calcul de l’indice est indisponible à cause des ménages collectifs (centres d’hébergement, pénitenciers) ou du taux de non-réponse trop élevé.","A17","https://www.santelaurentides.gouv.qc.ca/sante-publique/donnees-sur-la-population/panorama-de-la-defavorisation/","A1:O16","A1:O14","Répartition de la population selon les profils de défavorisation matérielle et sociale combinée 2021 de la région des Laurentides - secteur MRC de Deux-Montagnes","Plus d’un résident sur dix de la MRC de Deux-Montagnes habitent un secteur ayant des conditions parmi les plus défavorables à la fois sur le plan matériel et social (profil 5). Ces secteurs sont localisés à Deux-Montagnes, Pointe-Calumet, Saint-Eustache et à Sainte-Marthe-sur-le-Lac. À Pointe-Calumet, plus du tiers de la population habite dans ces secteurs.\n\nMise à jour : janvier 2024"]
[720,"720MatérielleRégional","Régional","Matérielle","A561:O569","A7:N9","J561:K569","A18:B20","A561:A569","MRC_DeuxMontagnes_Defavo_2016_Mat.png","MRC_DM_2016_Mat_Quintile","A5","B2","B5","B2","A5","Dans la MRC de Deux-Montagnes, on retrouve des secteurs ayant les conditions matérielles les plus défavorables (quintile 5 – en orangé) dans toutes les municipalités. \n\nPrès du tiers de la population de Pointe-Calumet et plus du quart de celle de Saint-Placide habitent ces secteurs. Si on regroupe les deux quintiles les plus défavorables (quintile 4 – en orangé pâle et quintile 5 – en orangé), on retrouvera plus de 9 résidents sur 10 de Pointe-Calumet et plus de la moitié de ceux de Saint-Placide et Saint-Eustache habitant ces secteurs.\n\nMise à jour : janvier 2024","Dans la MRC de Deux-Montagnes, on retrouve des secteurs ayant les conditions matérielles parmi les plus défavorables (quintile 5) dans toutes les municipalités. Près du tiers de la population de Pointe-Calumet et plus du quart de celle de Saint-Placide habitent ces secteurs.\n\nMise à jour : janvier 2024","Lorsqu’on se concentre sur l’évolution des secteurs se retrouvant dans des conditions parmi les plus défavorables matériellement (quintile 5 – en orangé), on constate que certains secteurs sont passés d’un quintile 3 ou 4 en 2016 au quintile 5 en 2021. Ils se trouvent dans Saint-Placide, Saint-Joseph-du-Lac et Saint-Eustache. À l’inverse, d’autres secteurs de Saint-Placide et de Saint-Eustache et des secteurs de Sainte-Marthe-sur-le-Lac sont passés d’un quintile 5 en 2016 à des quintiles plus favorisés en 2021. \n\nÀ savoir - Les variations entre 2016 et 2021 ont plusieurs causes possibles. Elles peuvent être dues à des changements 1) dans la population des secteurs auxquels on réfère, 2) dans la population de l’ensemble du territoire auquel les secteurs sont comparés, ou encore 3) dans la compilation de l’indice, en raison, par exemple, des modifications du découpage des secteurs ou des données manquantes.\n\nMise à jour : février 2024","J3:O40","A18:K33","Répartition de la population (N, %) parniveau de défavorisation matérielle 2021 de la région des Laurentides - secteur MRC de Deux-Montagnes","Source : INSPQ et BIESP, 2023. Statistique Canada, Recensement 2021.","A14","16.5","Population des secteurs ayant les conditions matérielles les plus défavorables - secteur MRC de Deux-Montagnes, 2021","Panorama de la défavorisation dans les Laurentides 2021, produit par l’équipe Surveillance, recherche et évaluation, Direction de santé publique des Laurentides, Centre intégré de santé et de services sociaux des Laurentides, 2024","A15","La population sans indice réside dans des secteurs où l’information pour le calcul de l’indice est indisponible à cause des ménages collectifs (centres d’hébergement, pénitenciers) ou du taux de non-réponse trop élevé.","A16","https://www.santelaurentides.gouv.qc.ca/sante-publique/donnees-sur-la-population/panorama-de-la-defavorisation/","A1:O15","A1:O13","Répartition de la population (N, %) par niveau de défavorisation matérielle 2021 de la région des Laurentides - secteur MRC de Deux-Montagnes","Dans la MRC de Deux-Montagnes, on retrouve des secteurs ayant les conditions matérielles parmi les plus défavorables (quintile 5) dans toutes les municipalités. Près du tiers de la population de Pointe-Calumet et plus du quart de celle de Saint-Placide habitent ces secteurs.\n\nMise à jour : janvier 2024"]
[720,"720SocialeRégional","Régional","Sociale","A660:O668","A7:N9","J660:K668","A18:B20","A660:A668","MRC_DeuxMontagnes_Defavo_2016_Soc.png","MRC_DM_2016_Soc_Quintile","A5","B2","B5","B2","A5","Dans la MRC de Deux-Montagnes, les secteurs ayant les conditions sociales les plus défavorables (quintile 5 – en orangé) se répartissent dans Pointe-Calumet, la municipalité de Deux-Montagnes et Saint-Eustache. En nombre, Saint-Eustache se démarque avec 10 600 personnes qui résident dans ces secteurs. \n\nMise à jour : janvier 2024","Dans la MRC de Deux-Montagnes, les secteurs ayant les conditions sociales parmi les plus défavorables (quintile 5) se répartissent dans les municipalités de Deux-Montagnes, Pointe-Calumet et Saint-Eustache. Environ le tiers de la population de la municipalité de Deux-Montagnes habite dans ces secteurs. \n\nMise à jour : janvier 2024","On observe peu de changements significatifs dans la MRC en ce qui a trait la répartition des secteurs où les conditions sont les plus défavorables sociale (quintile 5 – en orangé) de 2021 par rapport à celles de 2016. Quelques secteurs sont passés du quintile 5 à un quintile plus favorable à Sainte-Marthe-sur-le-Lac et Deux-Montagnes.\n\nÀ savoir - Les variations entre 2016 et 2021 ont plusieurs causes possibles. Elles peuvent être dues à des changements 1) dans la population des secteurs auxquels on réfère, 2) dans la population de l’ensemble du territoire auquel les secteurs sont comparés, ou encore 3) dans la compilation de l’indice, en raison, par exemple, des modifications du découpage des secteurs ou des données manquantes.\n\nMise à jour : février 2024","J3:O40","A18:K33","Répartition de la population (N, %) par niveau de défavorisation sociale 2021 de la région des Laurentides - secteur MRC de Deux-Montagnes","Source : INSPQ et BIESP, 2023. Statistique Canada, Recensement 2021.","A14","16.5","Population des secteurs ayant les conditions sociales les plus défavorables - secteur MRC de Deux-Montagnes, 2021","Panorama de la défavorisation dans les Laurentides 2021, produit par l’équipe Surveillance, recherche et évaluation, Direction de santé publique des Laurentides, Centre intégré de santé et de services sociaux des Laurentides, 2024","A15","La population sans indice réside dans des secteurs où l’information pour le calcul de l’indice est indisponible à cause des ménages collectifs (centres d’hébergement, pénitenciers) ou du taux de non-réponse trop élevé.","A16","https://www.santelaurentides.gouv.qc.ca/sante-publique/donnees-sur-la-population/panorama-de-la-defavorisation/","A1:O15","A1:O13","Répartition de la population (N, %) par niveau de défavorisation sociale 2021 de la région des Laurentides - secteur MRC de Deux-Montagnes","Dans la MRC de Deux-Montagnes, les secteurs ayant les conditions sociales parmi les plus défavorables (quintile 5) se répartissent dans les municipalités de Deux-Montagnes, Pointe-Calumet et Saint-Eustache. Environ le tiers de la population de la municipalité de Deux-Montagnes habite dans ces secteurs. \n\nMise à jour : janvier 2024"]
["730-1517","730-1517Matérielle et socialeRégional","Régional","Matérielle et sociale","A471:O479","A1:N4","J471:K479","A12:B15","A471:A479","MRC_ThereseBlainville_Defavo_2016_Comb.png","RLS_TDB_2016_Comb","A6","B2","B6","B2","A6","Dans la MRC/RLS de Thérèse-De Blainville, les secteurs ayant les conditions les plus défavorables à la fois sur le plan matériel et social (profil 5 – en violet) sont localisés à Boisbriand, Blainville, Sainte-Thérèse, Bois-des-Filion et Sainte Anne-des-Plaines. À Sainte Anne-des-Plaines et Sainte-Thérèse, c’est environ le quart de la population qui habite ces secteurs.\n\nLes secteurs où les conditions sont parmi les plus défavorables du territoire seulement sur le plan social (profil 3 – en bleu) se retrouvent dans toutes les municipalités du territoire, SAUF à Sainte-Anne-des-Plaines. Plus de la moitié de la population de Bois-des-Filion et plus de 40% de celle de Sainte-Thérèse résident dans ces secteurs.\n\nOn retrouve des secteurs qui présentent les conditions parmi les plus défavorables de la MRC/RLS uniquement sur le plan matériel (profil 4 – en orangé) à Boisbriand, Blainville, Sainte-Thérèse, Bois-des-Filion et Sainte Anne-des-Plaines. Près de la moitié de la population de Sainte-Anne-des-Plaines et le quart de celle de Boisbriand résident dans ces secteurs.\n\nMise à jour : janvier 2024 ","Environ un dixième de la population la MRC/RLS Thérèse-De Blainville habitent des secteurs ayant les conditions les plus défavorables à la fois sur le plan matériel et social (profil 5). Ces secteurs sont localisés à Blainville, Boisbriand, Bois-des-Filion, Sainte-Anne-des-Plaines et à Sainte-Thérèse. À Sainte Anne-des-Plaines et à Sainte-Thérèse, c’est environ le quart de la population qui habite dans ces secteurs.\n\nLe quart de la population de la MRC/RLS Thérèse-De Blainville habitent des secteurs où les conditions sont parmi les plus défavorables seulement sur le plan social (profil 3). Ces secteurs se retrouvent dans toutes les municipalités du territoire, SAUF à Sainte-Anne-des-Plaines. Plus de la moitié de la population de Bois-des-Filion et plus de 40% de celle de Sainte-Thérèse résident dans ces secteurs.\n\nEnviron un dixième de la population de la MRC/RLS Thérèse-De Blainville habitent des secteurs présentent les conditions plus défavorables uniquement sur le plan matériel (profil 4). Ces secteurs sont présents dans toutes les municipalités du territoire, SAUF à Lorraine et à Rosemère. Près de la moitié de la population de Sainte-Anne-des-Plaines et le quart de celle de Boisbriand résident dans ces secteurs.\n\nMise à jour : janvier 2024","Lorsqu’on se concentre sur l’évolution des secteurs présentant des conditions parmi les plus défavorables matériellement et socialement (profil 5 – en violet), on remarque que certains se sont ajoutés en 2021 par rapport à 2016 au profil 5 en 2021. Ils se trouvent dans Boisbriand, Blainville et Sainte-Anne-des-Plaines. À l’inverse, des secteurs de Sainte-Thérèse qui étaient de profil 5 en 2016 sont de profil 3 (défavorable socialement seulement – en bleu) en 2021.\n\nÀ savoir - Les variations entre 2016 et 2021 ont plusieurs causes possibles. Elles peuvent être dues à des changements 1) dans la population des secteurs auxquels on réfère, 2) dans la population de l’ensemble du territoire auquel les secteurs sont comparés, ou encore 3) dans la compilation de l’indice, en raison, par exemple, des modifications du découpage des secteurs ou des données manquantes.\n\nMise à jour : février 2024","J3:O40","A19:K34","Répartition de la population selon les profils de défavorisation matérielle et sociale combinée 2021 de la région des Laurentides - secteur MRC/RLS de Thérèse-De Blainville","Source : INSPQ et BIESP, 2023. Statistique Canada, Recensement 2021.","A15","49.5","Population des secteurs ayant les conditions matérielles et sociales les plus défavorables - secteur MRC/RLS de Thérèse-De Blainville, 2021","Panorama de la défavorisation dans les Laurentides 2021, produit par l’équipe Surveillance, recherche et évaluation, Direction de santé publique des Laurentides, Centre intégré de santé et de services sociaux des Laurentides, 2024","A16","La population sans indice réside dans des secteurs où l’information pour le calcul de l’indice est indisponible à cause des ménages collectifs (centres d’hébergement, pénitenciers) ou du taux de non-réponse trop élevé.","A17","https://www.santelaurentides.gouv.qc.ca/sante-publique/donnees-sur-la-population/panorama-de-la-defavorisation/","A1:O16","A1:O15","Répartition de la population selon les profils de défavorisation matérielle et sociale combinée 2021 de la région des Laurentides - secteur MRC/RLS de Thérèse-De Blainville","Environ un dixième de la population la MRC/RLS Thérèse-De Blainville habitent des secteurs ayant les conditions les plus défavorables à la fois sur le plan matériel et social (profil 5). Ces secteurs sont localisés à Blainville, Boisbriand, Bois-des-Filion, Sainte-Anne-des-Plaines et à Sainte-Thérèse. À Sainte Anne-des-Plaines et à Sainte-Thérèse, c’est environ le quart de la population qui habite dans ces secteurs.\n\nMise à jour : janvier 2024 "]
["730-1517","730-1517MatérielleRégional","Régional","Matérielle","A570:O578","A7:N9","J570:K578","A18:B20","A570:A578","MRC_ThereseBlainville_Defavo_2016_Mat.png","RLS_TDB_2016_Mat","A5","B2","B5","B2","A5","Dans la MRC/RLS Thérèse-De Blainville, les secteurs ayant les conditions matérielles parmi les plus défavorables (quintile 5 – en orangé) sont localisés Boisbriand, Blainville, Sainte-Thérèse, Bois-des-Filion et Sainte Anne-des-Plaines. Plus du tiers de la population de Sainte-Anne-des-Plaines habite ces secteurs.\n\nMise à jour : janvier 2024 ","Moins d’un dixième de la population de la MRC/RLS Thérèse-De Blainville habitent des secteurs ayant les conditions matérielles parmi les plus défavorables (quintile 5). Ces secteurs sont localisés à Blainville, Boisbriand, Bois-des-Filion, Sainte-Anne-des-Plaines et à Sainte-Thérèse. C’est à Sainte-Anne-des-Plaines et à Boisbriand qu’on trouve le plus de personnes qui habitent ces secteurs.\n\nMise à jour : janvier 2024","Lorsqu’on se concentre sur l’évolution des secteurs présentant des conditions parmi les plus défavorables matériellement (quintile 5 - orangé), on constate que des secteurs se sont ajoutés à Sainte-Anne-des-Plaines et à Blainville. À l’inverse, d’autres secteurs de Blainville, de Sainte-Anne-des-Plaines et des secteurs de Sainte-Thérèse qui étaient de quintile 5 en 2016 affichent des quintiles plus favorables en 2021.\n\nÀ savoir - Les variations entre 2016 et 2021 ont plusieurs causes possibles. Elles peuvent être dues à des changements 1) dans la population des secteurs auxquels on réfère, 2) dans la population de l’ensemble du territoire auquel les secteurs sont comparés, ou encore 3) dans la compilation de l’indice, en raison, par exemple, des modifications du découpage des secteurs ou des données manquantes.\n\nMise à jour : février 2024","J3:O40","A18:K33","Répartition de la population (N, %) par niveau de défavorisation matérielle 2021 de la région des Laurentides - secteur MRC/RLS de Thérèse-De Blainville","Source : INSPQ et BIESP, 2023. Statistique Canada, Recensement 2021.","A14","16.5","Population des secteurs ayant les conditions matérielles les plus défavorables - secteur MRC/RLS de Thérèse-De Blainville, 2021","Panorama de la défavorisation dans les Laurentides 2021, produit par l’équipe Surveillance, recherche et évaluation, Direction de santé publique des Laurentides, Centre intégré de santé et de services sociaux des Laurentides, 2024","A15","La population sans indice réside dans des secteurs où l’information pour le calcul de l’indice est indisponible à cause des ménages collectifs (centres d’hébergement, pénitenciers) ou du taux de non-réponse trop élevé.","A16","https://www.santelaurentides.gouv.qc.ca/sante-publique/donnees-sur-la-population/panorama-de-la-defavorisation/","A1:O15","A1:O14","Répartition de la population (N, %) par niveau de défavorisation matérielle 2021 de la région des Laurentides - secteur MRC/RLS de Thérèse-De Blainville","Moins d’un dixième de la population de la MRC/RLS Thérèse-De Blainville habitent des secteurs ayant les conditions matérielles parmi les plus défavorables (quintile 5). Ces secteurs sont localisés à Blainville, Boisbriand, Bois-des-Filion, Sainte-Anne-des-Plaines et à Sainte-Thérèse. C’est à  Sainte-Anne-des-Plaines et à Boisbrian qu’on trouve le plus de personnes qui habitent ces secteurs.\n\nMise à jour : janvier 2024 "]
["730-1517","730-1517SocialeRégional","Régional","Sociale","A669:O677","A7:N9","J669:K677","A18:B20","A669:A677","MRC_ThereseBlainville_Defavo_2016_Soc.png","RLS_TDB_2016_Soc","A5","B2","B5","B2","A5","Dans la MRC/RLS Thérèse-De Blainville, les secteurs ayant les conditions sociales parmi les plus défavorables (quintile  5 – en orangé) sont répartis dans toutes les municipalités du territoire, SAUF à Lorraine. Environ la moitié de la population de Sainte-Thérèse et de Bois-des-Filion habite ces secteurs. C’est aussi le cas pour plus du quart des résidents de Boisbriand.\n\nMise à jour : janvier 2024 ","Plus d’un cinquième de la population de la MRC/RLS Thérèse-De Blainville habitent des secteurs ayant les conditions sociales les plus défavorables (quintile 5).  Ces derniers sont répartis dans toutes les municipalités du territoire, SAUF à Lorraine. Environ la moitié de la population de Sainte-Thérèse et de Bois-des-Filion habite ces secteurs. C’est aussi le cas pour plus du quart des résidents de Boisbriand.\nMise à jour : décembre 2023","Lorsqu’on se concentre sur l’évolution des secteurs présentant des conditions parmi les plus défavorables socialement (quintile 5 - orangé), on constate que certains se sont ajoutés à Sainte-Anne-des-Plaines, Blainville et Rosemère. À l’inverse, d’autres secteurs de Rosemère, Boisbriand et de Blainville qui étaient de quintile 5 en 2016 affichent des quintiles plus favorables en 2021.\n\nÀ savoir - Les variations entre 2016 et 2021 ont plusieurs causes possibles. Elles peuvent être dues à des changements 1) dans la population des secteurs auxquels on réfère, 2) dans la population de l’ensemble du territoire auquel les secteurs sont comparés, ou encore 3) dans la compilation de l’indice, en raison, par exemple, des modifications du découpage des secteurs ou des données manquantes.\n\nMise à jour : février 2024","J3:O40","A18:K33","Répartition de la population (N, %) par niveau de défavorisation sociale 2021 de la région des Laurentides - secteur MRC/RLS de Thérèse-De Blainville","Source : INSPQ et BIESP, 2023. Statistique Canada, Recensement 2021.","A14","16.5","Population des secteurs ayant les conditions sociales les plus défavorables - secteur MRC/RLS de Thérèse-De Blainville, 2021","Panorama de la défavorisation dans les Laurentides 2021, produit par l’équipe Surveillance, recherche et évaluation, Direction de santé publique des Laurentides, Centre intégré de santé et de services sociaux des Laurentides, 2024","A15","La population sans indice réside dans des secteurs où l’information pour le calcul de l’indice est indisponible à cause des ménages collectifs (centres d’hébergement, pénitenciers) ou du taux de non-réponse trop élevé.","A16","https://www.santelaurentides.gouv.qc.ca/sante-publique/donnees-sur-la-population/panorama-de-la-defavorisation/","A1:O15","A1:O14","Répartition de la population (N, %) par niveau de défavorisation sociale 2021 de la région des Laurentides - secteur MRC/RLS de Thérèse-De Blainville","Dans la MRC/RLS Thérèse-De Blainville, les secteurs ayant les conditions sociales parmi les plus défavorables (quintile  5) sont répartis dans toutes les municipalités du territoire, SAUF à Lorraine. Environ la moitié de la population de Sainte-Thérèse et de Bois-des-Filion habite ces secteurs. C’est aussi le cas pour plus du quart des résidents de Boisbriand.\n\nMise à jour : janvier 2024 "]
[740,"740Matérielle et socialeRégional","Régional","Matérielle et sociale","A480:O481","A1:N4","J480:K481","A12:B15","A480:A481","MRC_Mirabel_Defavo_2016_Comb.png","MIR_2016_Comb","A6","B2","B6","B2","A6","On remarque des secteurs ayant les conditions les plus défavorisées matériellement et socialement (profil 5 – en violet) de Mirabel dans les secteurs de Saint-Canut, Saint-Janvier et de Saint-Augustin. \n\nLes secteurs qui présentent les conditions les plus défavorables de Mirabel seulement sur le plan social (profil 3 – en bleu) se situent dans Saint-Canut, Sainte-Monique, Saint-Augustin et Saint- Janvier.\n\nLes secteurs dont les conditions sont les plus défavorables sur le plan matériel seulement (profil 4 – en orangé) se situent dans Saint-Hermas, Saint-Canut, Saint-Canut, Saint-Augustin et Saint-Janvier.\n\nMise à jour : janvier 2024","11,0 % de la population de Mirabel, soit 6 700 personnes, habitent des secteurs ayant les conditions parmi les plus défavorables à la fois sur le plan matériel et social (profil 5).\n\nLes secteurs qui présentent les conditions plus défavorables uniquement sur le plan social (profil 3) regroupent 26,4 % de la population (16 200 personnes).\n\nLes secteurs dont les conditions sont les plus défavorables seulement sur le plan matériel (profil 4) hébergent 12,3 % de la population de la municipalité, ce qui correspond à 7 500 personnes.\n\nMise à jour : janvier 2024","En 2021, comme en 2016, on retrouve peu de secteurs dont les conditions sont parmi les plus défavorables à la fois sur le plan matériel et social (profil 5 – en violet) dans Mirabel. Des secteurs sont passés du profil 3 (bleu) au profil 5 dans Saint-Janvier. À l’inverse, on constate que quelques secteurs sont passés du profil 5 en 2016 au profil 3 en 2021 dans Saint-Canut, Saint-Scholastique et Sainte-Monique. \n\nÀ savoir - Les variations entre 2016 et 2021 ont plusieurs causes possibles. Elles peuvent être dues à des changements 1) dans la population des secteurs auxquels on réfère, 2) dans la population de l’ensemble du territoire auquel les secteurs sont comparés, ou encore 3) dans la compilation de l’indice, en raison, par exemple, des modifications du découpage des secteurs ou des données manquantes.\n\nMise à jour : février 2024","J3:O40","A13:K28","Répartition de la population selon les profils de défavorisation matérielle et sociale combinée 2021 de la région des Laurentides - secteur Mirabel","Source : INSPQ et BIESP, 2023. Statistique Canada, Recensement 2021.","A9","49.5","Population des secteurs ayant les conditions matérielles et sociales les plus défavorabless - secteur Mirabel, 2021","Panorama de la défavorisation dans les Laurentides 2021, produit par l’équipe Surveillance, recherche et évaluation, Direction de santé publique des Laurentides, Centre intégré de santé et de services sociaux des Laurentides, 2024","A10","La population sans indice réside dans des secteurs où l’information pour le calcul de l’indice est indisponible à cause des ménages collectifs (centres d’hébergement, pénitenciers) ou du taux de non-réponse trop élevé.","A11","https://www.santelaurentides.gouv.qc.ca/sante-publique/donnees-sur-la-population/panorama-de-la-defavorisation/","A1:O10","A1:O9","Répartition de la population selon les profils de défavorisation matérielle et sociale combinée 2021 de la région des Laurentides - secteur Mirabel","11,0 % de la population de Mirabel, soit 6 700 personnes, habitent des secteurs ayant les conditions parmi les plus défavorables à la fois sur le plan matériel et social (profil 5).\n\nMise à jour : janvier 2024"]
[740,"740MatérielleRégional","Régional","Matérielle","A579:O580","A7:N9","J579:K580","A18:B20","A579:A580","MRC_Mirabel_Defavo_2016_Mat.png","MIR_2016_Mat","A5","B2","B5","B2","A5","Les secteurs de Mirabel ayant les conditions matérielles les plus défavorables (quintile 5 – en orangé) se situent essentiellement dans Saint-Augustin et Saint-Janvier. \n\nMise à jour : janvier 2024","Près d’une personne sur 10 dans la population de Mirabel habite les secteurs ayant les conditions matérielles les plus défavorables (quintile 5), soit plus de 5 200 personnes. \n\nMise à jour : janvier 2024","Lorsqu’on se concentre sur l’évolution des secteurs se retrouvant dans des conditions parmi les plus défavorables matériellement (quintile 5 – en orangé), on constate que certains secteurs sont passés d’un quintile  1 à 4 en 2016 au quintile  5 en 2021, dans Saint-Hermas, Saint-Canut, Saint-Augustin et le Petit-Brûlé.\n\nÀ savoir - Les variations entre 2016 et 2021 ont plusieurs causes possibles. Elles peuvent être dues à des changements 1) dans la population des secteurs auxquels on réfère, 2) dans la population de l’ensemble du territoire auquel les secteurs sont comparés, ou encore 3) dans la compilation de l’indice, en raison, par exemple, des modifications du découpage des secteurs ou des données manquantes.\n\nMise à jour : février 2024","J3:O40","A12:K27","Répartition de la population (N, %) par niveau de défavorisation matérielle 2021 de la région des Laurentides - secteur Mirabel","Source : INSPQ et BIESP, 2023. Statistique Canada, Recensement 2021.","A8","16.5","Population des secteurs ayant les conditions matérielles les plus défavorabless - secteur Mirabel, 2021","Panorama de la défavorisation dans les Laurentides 2021, produit par l’équipe Surveillance, recherche et évaluation, Direction de santé publique des Laurentides, Centre intégré de santé et de services sociaux des Laurentides, 2024","A9","La population sans indice réside dans des secteurs où l’information pour le calcul de l’indice est indisponible à cause des ménages collectifs (centres d’hébergement, pénitenciers) ou du taux de non-réponse trop élevé.","A10","https://www.santelaurentides.gouv.qc.ca/sante-publique/donnees-sur-la-population/panorama-de-la-defavorisation/","A1:O9","A1:O8","Répartition de la population (N, %) par niveau de défavorisation matérielle 2021 de la région des Laurentides - secteur Mirabel","Près d’une personne sur 10 dans la population de Mirabel habite les secteurs ayant les conditions matérielles les plus défavorables (quintile 5), soit plus de 5 200 personnes. \nMise à jour : janvier 2024"]
[740,"740SocialeRégional","Régional","Sociale","A678:O679","A7:N9","J678:K679","A18:B20","A678:A679","MRC_Mirabel_Defavo_2016_Soc.png","MIR_2016_Soc","A5","B2","B5","B2","A5","Les secteurs de Mirabel ayant les conditions sociales les plus défavorables (quintile 5 – en orangé) se situent essentiellement dans Saint-Canut, Sainte-Monique, Saint-Augustin et Saint-Janvier. \n\nMise à jour : janvier 2024","Près d’une personne sur 10 dans la population de Mirabel habite des secteurs ayant les conditions sociales les plus défavorables (quintile 5) correspond à environ 5 500 personnes. \n\nMise à jour : janvier 2024","Lorsqu’on se concentre sur l’évolution des secteurs se retrouvant dans des conditions parmi les plus défavorables matériellement (quintile 5 – en orangé) de la région des Laurentides, on constate que certains secteurs sont passés d’un quintile  4 en 2016 au quintile  5 en 2021 dans Saint-Augustin.\n\nÀ savoir - Les variations entre 2016 et 2021 ont plusieurs causes possibles. Elles peuvent être dues à des changements 1) dans la population des secteurs auxquels on réfère, 2) dans la population de l’ensemble du territoire auquel les secteurs sont comparés, ou encore 3) dans la compilation de l’indice, en raison, par exemple, des modifications du découpage des secteurs ou des données manquantes.\n\nMise à jour : février 2024","J3:O40","A12:K27","Répartition de la population (N, %) par niveau de défavorisation sociale 2021 de la région des Laurentides - secteur Mirabel","Source : INSPQ et BIESP, 2023. Statistique Canada, Recensement 2021.","A8","16.5","Population des secteurs ayant les conditions sociales les plus défavorabless - secteur Mirabel, 2021","Panorama de la défavorisation dans les Laurentides 2021, produit par l’équipe Surveillance, recherche et évaluation, Direction de santé publique des Laurentides, Centre intégré de santé et de services sociaux des Laurentides, 2024","A9","La population sans indice réside dans des secteurs où l’information pour le calcul de l’indice est indisponible à cause des ménages collectifs (centres d’hébergement, pénitenciers) ou du taux de non-réponse trop élevé.","A10","https://www.santelaurentides.gouv.qc.ca/sante-publique/donnees-sur-la-population/panorama-de-la-defavorisation/","A1:O9","A1:O8","Répartition de la population (N, %) par niveau de défavorisation sociale 2021 de la région des Laurentides - secteur Mirabel","Près d’une personne sur 10 dans la population de Mirabel habite des secteurs ayant les conditions sociales les plus défavorables (quintile 5) correspond à environ 5 500 personnes. \n\nMise à jour : janvier 2024"]
[750,"750Matérielle et socialeRégional","Régional","Matérielle et sociale","A483:O489","A1:N4","J483:K489","A12:B15","A483:A489","RdN","MRC_RDN_2016_Comb_Quintile","A6","B2","B6","B2","A6","Dans le MRC de la Rivière-du-Nord, les secteurs ayant les conditions les plus défavorables à la fois au plan matériel et social (profil 5 – en violet) dans toutes les municipalités du territoire SAUF à Saint-Colomban. Plus du tiers de la population de Saint-Jérôme habite ces secteurs.\n\nLes secteurs où les conditions sont parmi les plus défavorables seulement au plan social (profil 3 – en bleu) se retrouvent à Saint-Jérôme, Prévost et Saint-Hippolyte. \n\nOn retrouve des secteurs qui présentent les conditions parmi les plus défavorables uniquement au plan matériel (profil 4 – en orangé) dans toutes les municipalités du territoire. Les trois-quarts de la population de Sainte-Sophie résident dans ces secteurs.\n\nMise à jour : janvier 2024","Plus d’un cinquième de la population de la MRC de la Rivière-du-Nord habitent des secteurs ayant les conditions les plus défavorables à la fois au plan matériel et social (profil 5). Ces secteurs sont localisés à Prévost, Saint-Hippolyte, Sainte-Sophie et Saint-Jérôme. Le tiers de la population de Saint-Jérôme habite ces secteurs.\n\nLe quart de la population de la MRC de la Rivière-du-Nord habitent des secteurs où les conditions sont les plus défavorables seulement au plan social (profil 3). Ces derniers se retrouvent à Prévost, Saint-Hippolyte et Saint-Jérôme. \n\nLe quart de la population de la MRC de la Rivière-du-Nord habitent des secteurs où les conditions sont les plus défavorables uniquement au plan matériel (profil 4). On retrouve ces secteurs dans toutes les municipalités du territoire. Plus des trois-quarts de la population de Sainte-Sophie résident dans ces secteurs.\n\nMise à jour : janvier 2024","Lorsqu’on se concentre sur l’évolution des secteurs du profil 5 (violet), soit ceux ayant les conditions matérielles et sociales parmi les plus défavorables, on remarque que plusieurs se sont ajoutés en 2021 par rapport à 2016, dans Saint-Hippolyte et Sainte-Sophie. À l’inverse, certains secteurs de Saint-Jérôme sont passés d’un profil 5 en 2016 à un profil 3 (défavorisés socialement seulement, en bleu) en 2021.\n\nÀ savoir - Les variations entre 2016 et 2021 ont plusieurs causes possibles. Elles peuvent être dues à des changements 1) dans la population des secteurs auxquels on réfère, 2) dans la population de l’ensemble du territoire auquel les secteurs sont comparés, ou encore 3) dans la compilation de l’indice, en raison, par exemple, des modifications du découpage des secteurs ou des données manquantes. \n\nMise à jour : février 2024","J3:O40","A17:K32","Répartition de la population selon les profils de défavorisation matérielle et sociale combinée 2021 de la région des Laurentides - secteur MRC de la Rivière-du-Nord","Source : INSPQ et BIESP, 2023. Statistique Canada, Recensement 2021.","A13","49.5","Population des secteurs ayant les conditions matérielles et sociales les plus défavorabless - secteur MRC de la Rivière-du-Nord, 2021","Panorama de la défavorisation dans les Laurentides 2021, produit par l’équipe Surveillance, recherche et évaluation, Direction de santé publique des Laurentides, Centre intégré de santé et de services sociaux des Laurentides, 2024","A14","La population sans indice réside dans des secteurs où l’information pour le calcul de l’indice est indisponible à cause des ménages collectifs (centres d’hébergement, pénitenciers) ou du taux de non-réponse trop élevé.","A15","https://www.santelaurentides.gouv.qc.ca/sante-publique/donnees-sur-la-population/panorama-de-la-defavorisation/","A1:O14","A1:O13","Répartition de la population selon les profils de défavorisation matérielle et sociale combinée 2021 de la région des Laurentides - secteur MRC de la Rivière-du-Nord","Plus d’un cinquième de la population de la MRC de la Rivière-du-Nord habitent des secteurs ayant les conditions les plus défavorables à la fois au plan matériel et social (profil 5). Ces secteurs sont localisés à Prévost, Saint-Hippolyte, Sainte-Sophie et Saint-Jérôme. Le tiers de la population de Saint-Jérôme habite ces secteurs.\n\n Mise à jour : janvier 2024"]
[750,"750MatérielleRégional","Régional","Matérielle","A582:O588","A7:N9","J582:K588","A18:B20","A582:A588","RdN","MRC_RDN_2016_Mat_Quintile","A5","B2","B5","B2","A5","Dans MRC de la Rivière-du-Nord, les secteurs ayant les conditions matérielles parmi les plus défavorables (quintile 5 – en orangé) se situent à Saint –Colomban, Saint-Jérôme et Sainte-Sophie. Le tiers de la population de Sainte-Sophie et plus du quart de celle de Saint-Jérôme habitent ces secteurs. \n\nMise à jour : janvier 2024","Environ un cinquième de la population de la MRC de la Rivière-du-Nord habitent des secteurs ayant les conditions matérielles les plus défavorables (quintile 5). Ces secteurs se trouvent à Saint-Colomban, Sainte-Sophie et Saint-Jérôme. Le tiers de la population de Sainte-Sophie et plus du quart de celle de Saint-Jérôme habitent ces secteurs. \n\nMise à jour : janvier 2024","Lorsqu’on se concentre sur l’évolution des secteurs se retrouvant dans des conditions parmi les plus défavorables matériellement (quintile 5 – en orangé), on constate que certains secteurs sont passés d’un quintile 3 ou 4 en 2016 au quintile 5 en 2021. Ils se trouvent dans Saint-Colomban, Saint-Jérôme et Sainte-Sophie. À l’inverse, d’autres secteurs de Saint-Jérôme sont passés d’un quintile 5 en 2016 à des quintiles plus favorisés en 2021. \n\nÀ savoir - Les variations entre 2016 et 2021 ont plusieurs causes possibles. Elles peuvent être dues à des changements 1) dans la population des secteurs auxquels on réfère, 2) dans la population de l’ensemble du territoire auquel les secteurs sont comparés, ou encore 3) dans la compilation de l’indice, en raison, par exemple, des modifications du découpage des secteurs ou des données manquantes.\n\nMise à jour : février 2024","J3:O40","A16:K31","Répartition de la population (N, %) par niveau de défavorisation matérielle 2021 de la région des Laurentides - secteur MRC de la Rivière-du-Nord","Source : INSPQ et BIESP, 2023. Statistique Canada, Recensement 2021.","A12","16.5","Population des secteurs ayant les conditions matérielles les plus défavorabless - secteur MRC de la Rivière-du-Nord, 2021","Panorama de la défavorisation dans les Laurentides 2021, produit par l’équipe Surveillance, recherche et évaluation, Direction de santé publique des Laurentides, Centre intégré de santé et de services sociaux des Laurentides, 2024","A13","La population sans indice réside dans des secteurs où l’information pour le calcul de l’indice est indisponible à cause des ménages collectifs (centres d’hébergement, pénitenciers) ou du taux de non-réponse trop élevé.","A14","https://www.santelaurentides.gouv.qc.ca/sante-publique/donnees-sur-la-population/panorama-de-la-defavorisation/","A1:O13","A1:O12","Répartition de la population (N, %) par niveau de défavorisation matérielle 2021 de la région des Laurentides - secteur MRC de la Rivière-du-Nord","Environ un cinquième de la population de la MRC de la Rivière-du-Nord habitent des secteurs ayant les conditions matérielles les plus défavorables (quintile 5). Ces secteurs se trouvent à Saint-Colomban, Sainte-Sophie et Saint-Jérôme. Le tiers de la population de Sainte-Sophie et plus du quart de celle de Saint-Jérôme habitent ces secteurs. \n\nMise à jour : janvier 2024"]
[750,"750SocialeRégional","Régional","Sociale","A681:O687","A7:N9","J681:K687","A18:B20","A681:A687","RdN","MRC_RDN_2016_Soc_Quintile","A5","B2","B5","B2","A5","Dans la MRC de la Rivière-du-Nord, les secteurs ayant les conditions sociales parmi les plus défavorables (quintile 5 – en orangé) sont localisés à Prévost et principalement à Saint-Jérôme. Plus de 40 % des Jérômiens habitent ces secteurs. \n\nMise à jour : janvier 2024","Environ un quart de la population de la MRC de la Rivière-du-Nord habitent des secteurs ayant les conditions sociales les plus défavorables (quintile 5). Ces secteurs se trouvent à Prévost et à Saint-Jérôme. Plus de 40 % des Jérômiens habitent ces secteurs. \n\nMise à jour : janvier 2024","On n’observe pas de changements significatifs dans la répartition des secteurs où les conditions sont les plus défavorables sociale (quintile 5 – en orangé) de 2021 par rapport à celles de 2016.\n\nÀ savoir - Les variations entre 2016 et 2021 ont plusieurs causes possibles. Elles peuvent être dues à des changements 1) dans la population des secteurs auxquels on réfère, 2) dans la population de l’ensemble du territoire auquel les secteurs sont comparés, ou encore 3) dans la compilation de l’indice, en raison, par exemple, des modifications du découpage des secteurs ou des données manquantes.\n\nMise à jour : février 2024","J3:O40","A16:K31","Répartition de la population (N, %) par niveau de défavorisation sociale 2021 de la région des Laurentides - secteur MRC de la Rivière-du-Nord","Source : INSPQ et BIESP, 2023. Statistique Canada, Recensement 2021.","A12","16.5","Population des secteurs ayant les conditions sociales les plus défavorabless - secteur MRC de la Rivière-du-Nord, 2021","Panorama de la défavorisation dans les Laurentides 2021, produit par l’équipe Surveillance, recherche et évaluation, Direction de santé publique des Laurentides, Centre intégré de santé et de services sociaux des Laurentides, 2024","A13","La population sans indice réside dans des secteurs où l’information pour le calcul de l’indice est indisponible à cause des ménages collectifs (centres d’hébergement, pénitenciers) ou du taux de non-réponse trop élevé.","A14","https://www.santelaurentides.gouv.qc.ca/sante-publique/donnees-sur-la-population/panorama-de-la-defavorisation/","A1:O13","A1:O12","Répartition de la population (N, %) par niveau de défavorisation sociale 2021 de la région des Laurentides - secteur MRC de la Rivière-du-Nord","Environ un quart de la population de la MRC de la Rivière-du-Nord habitent des secteurs ayant les conditions sociales les plus défavorables (quintile 5). Ces secteurs se trouvent à Prévost et à Saint-Jérôme. Plus de 40 % des Jérômiens habitent ces secteurs. \n\nMise à jour : janvier 2024 "]
["760-1514","760-1514Matérielle et socialeRégional","Régional","Matérielle et sociale","A490:O500","A1:N4","J490:K500","A12:B15","A490:A500","MRC/RLS Argenteuil","RLS_ARG_2016_Comb","A6","B2","B6","B2","A6","Dans la MRC/RLS d’Argenteuil, les secteurs ayant les conditions parmi les plus défavorables à la fois sur le plan matériel et social (profil 5 – en violet) sont localisés à Brownsburg-Chatham, Grenville, Grenville-sur-la-Rouge et Lachute. \n\nOn ne retrouve qu’un seul secteur où les conditions les plus défavorables sur le plan social uniquement (profil 3 – en bleu), situé à Brownsburg-Chatham. \n\nOn retrouve des secteurs qui présentent les conditions les plus défavorables seulement sur le plan matériel (profil 4 – en orangé) dans toutes les municipalités du territoire, SAUF à Grenville et Wentworth. \n\nGore est la seule municipalité du terriroire où on retrouve des secteurs avec les condition les plus favorables à la fois sur le plan matériel et social (profil 1 – en vert).\n\nMise à jour : janvier 2024","Près de la moitié de la population de la MRC/RLS d’Argenteuil habitent des secteurs ayant les conditions parmi les plus défavorables à la fois sur le plan matériel et social (profil 5). Ces derniers sont localisés à Brownsburg-Chatham, à Grenville, à Grenville-sur-la-Rouge et à Lachute. \n\nOn trouve très peu de secteurs où les conditions sont les plus défavorables sur le plan social uniquement (profil 3).  Il n’y a qu’à Brownsburg-Chatham où des résidents habitent un tel secteur.\n\nLe tiers de la population de la MRC/RLS habite des secteurs qui présentent les conditions parmi les plus défavorables seulement sur le plan matériel (profil 4). Il se répartissent dans toutes les municiplités du territoire, SAUF Grenville et Wentworth. \n\nMise à jour : janvier 2024","Lorsqu’on se concentre sur l’évolution des secteurs du profil 5 (violet), soit ceux ayant les conditions matérielles et sociales les plus défavorables, on remarque que plusieurs se sont ajoutés en 2021 par rapport à 2016. Ils se trouvent dans Grenville-sur-la-Rouge, Grenville, Brownburg-Chatham et Lachute. \n\nÀ savoir - Les variations entre 2016 et 2021 ont plusieurs causes possibles. Elles peuvent être dues à des changements 1) dans la population des secteurs auxquels on réfère, 2) dans la population de l’ensemble du territoire auquel les secteurs sont comparés, ou encore 3) dans la compilation de l’indice, en raison, par exemple, des modifications du découpage des secteurs ou des données manquantes.\n\nMise à jour : février 2024","J3:O40","A21:K36","Répartition de la population selon les profils de défavorisation matérielle et sociale combinée 2021 de la région des Laurentides - secteur MRC/RLS d'Argenteuil","Source : INSPQ et BIESP, 2023. Statistique Canada, Recensement 2021.","A17","49.5","Population des secteurs ayant les conditions matérielles et sociales les plus défavorables - secteur MRC/RLS d'Argenteuil, 2021","Panorama de la défavorisation dans les Laurentides 2021, produit par l’équipe Surveillance, recherche et évaluation, Direction de santé publique des Laurentides, Centre intégré de santé et de services sociaux des Laurentides, 2024","A18","La population sans indice réside dans des secteurs où l’information pour le calcul de l’indice est indisponible à cause des ménages collectifs (centres d’hébergement, pénitenciers) ou du taux de non-réponse trop élevé.","A19","https://www.santelaurentides.gouv.qc.ca/sante-publique/donnees-sur-la-population/panorama-de-la-defavorisation/","A1:O18","A1:O17","Répartition de la population selon les profils de défavorisation matérielle et sociale combinée 2021 de la région des Laurentides - secteur MRC/RLS d'Argenteuil","Près de la moitié de la population de la MRC/RLS d’Argenteuil habitent des secteurs ayant les conditions parmi les plus défavorables à la fois sur le plan matériel et social (profil 5). Ces derniers sont localisés à Brownsburg-Chatham, à Grenville, à Grenville-sur-la-Rouge et à Lachute. \n\nMise à jour : janvier 2024"]
["760-1514","760-1514MatérielleRégional","Régional","Matérielle","A589:O599","A7:N9","J589:K599","A18:B20","A589:A599","MRC/RLS Argenteuil","RLS_ARG_2016_Mat","A5","B2","B5","B2","A5","Dans la MRC/RLS d’Argenteuil, on retrouve des secteurs ayant les conditions matérielles les plus défavorables (quintile 5 – en orangé) dans toutes les municipalités, SAUF Mille-Isles et Wentworth.  Plus de la moitié des résidents de la MRC/RLS habite ces secteurs.\n\nMise à jour : janvier 2024","Plus de la moitié de la population de la MRC/RLS d’Argenteuil résident des secteurs ayant les conditions matérielles parmi les plus défavorables (quintile 5). Ces secteurs se trouvent dans toutes les municipalités de la MRC/RLS, SAUF Mille-Isles et Wentworth.\n\nMise à jour : janvier 2024","Lorsqu’on se concentre sur l’évolution des secteurs où les conditions sont parmi les plus défavorables matériellement (quintile 5 – en orangé), on constate que certains sont passés d’un quintile 4 en 2016 au quintile 5 en 2021. Ils se trouvent dans Harrington, Grenville-sur-la-Rouge, Lachute et Saint-André-d’Argenteuil. À l’inverse, d’autres secteurs qui étaient de quintiles 1 à 4 en 2016 sont passés au quintile 5, plus défavorable, en 2021. Ces secteurs se situent à Lachute et Saint-André-d’Argenteuil.\n\nÀ savoir - Les variations entre 2016 et 2021 ont plusieurs causes possibles. Elles peuvent être dues à des changements 1) dans la population des secteurs auxquels on réfère, 2) dans la population de l’ensemble du territoire auquel les secteurs sont comparés, ou encore 3) dans la compilation de l’indice, en raison, par exemple, des modifications du découpage des secteurs ou des données manquantes.\n\nMise à jour : février 2024","J3:O40","A20:K35","Répartition de la population (N, %) par niveau de défavorisation matérielle 2021 de la région des Laurentides - secteur MRC/RLS d'Argenteuil","Source : INSPQ et BIESP, 2023. Statistique Canada, Recensement 2021.","A16","16.5","Population des secteurs ayant les conditions matérielles les plus défavorables - secteur MRC/RLS d'Argenteuil, 2021","Panorama de la défavorisation dans les Laurentides 2021, produit par l’équipe Surveillance, recherche et évaluation, Direction de santé publique des Laurentides, Centre intégré de santé et de services sociaux des Laurentides, 2024","A17","La population sans indice réside dans des secteurs où l’information pour le calcul de l’indice est indisponible à cause des ménages collectifs (centres d’hébergement, pénitenciers) ou du taux de non-réponse trop élevé.","A18","https://www.santelaurentides.gouv.qc.ca/sante-publique/donnees-sur-la-population/panorama-de-la-defavorisation/","A1:O17","A1:O16","Répartition de la population (N, %) par niveau de défavorisation matérielle 2021 de la région des Laurentides - secteur MRC/RLS d'Argenteuil","Plus de la moitié de la population de la MRC/RLS d’Argenteuil résident des secteurs ayant les conditions matérielles parmi les plus défavorables (quintile 5). Ces secteurs se trouvent dans toutes les municipalités du territoire, SAUF Mille-Isles et Wentworth.\n\nMise à jour : janvier 2024"]
["760-1514","760-1514SocialeRégional","Régional","Sociale","A688:O698","A7:N9","J688:K698","A18:B20","A688:A698","MRC/RLS Argenteuil","RLS_ARG_2016_Soc","A5","B2","B5","B2","A5","Dans la MRC/RLS d’Argenteuil, les secteurs ayant les conditions sociales les plus défavorables (quintile 5 – en orangé) se répartissent dans Grenville, Brownsburg-Chatham et Lachute. Plus du tiers de la population de Lachute et l’ensemble de la population de Grenville habitent ces secteurs. \n\nMise à jour : janvier 2024","Environ un cinquième de la population de la MRC/RLS d’Argenteuil habitent des secteurs ayant les conditions sociales parmi les plus défavorables (quintile 5). Ces secteurs se répartissent dans Brownsburg-Chatham, Grenville et Lachute. \n\nMise à jour : janvier 2024","Sur le plan de la défavorisation sociale, la MRC/RLS Argenteuil présente un profil globalement favorable comparé à la région des Laurentides. Si on se concentre sur les secteurs ayant les conditions sociales parmi les plus défavorables (quintile 5 – en orangé), on remarque néanmoins que certains secteurs sont passés d’un quintile 4 en 2016 au quintile 5 en 2021 dans Grenville et Lachute.\n\nÀ savoir - Les variations entre 2016 et 2021 ont plusieurs causes possibles. Elles peuvent être dues à des changements 1) dans la population des secteurs auxquels on réfère, 2) dans la population de l’ensemble du territoire auquel les secteurs sont comparés, ou encore 3) dans la compilation de l’indice, en raison, par exemple, des modifications du découpage des secteurs ou des données manquantes.\n\nMise à jour : février 2024","J3:O40","A20:K35","Répartition de la population (N, %) par niveau de défavorisation sociale 2021 de la région des Laurentides - secteur MRC/RLS d'Argenteuil","Source : INSPQ et BIESP, 2023. Statistique Canada, Recensement 2021.","A16","16.5","Population des secteurs ayant les conditions sociales les plus défavorables - secteur MRC/RLS d'Argenteuil, 2021","Panorama de la défavorisation dans les Laurentides 2021, produit par l’équipe Surveillance, recherche et évaluation, Direction de santé publique des Laurentides, Centre intégré de santé et de services sociaux des Laurentides, 2024","A17","La population sans indice réside dans des secteurs où l’information pour le calcul de l’indice est indisponible à cause des ménages collectifs (centres d’hébergement, pénitenciers) ou du taux de non-réponse trop élevé.","A18","https://www.santelaurentides.gouv.qc.ca/sante-publique/donnees-sur-la-population/panorama-de-la-defavorisation/","A1:O17","A1:O16","Répartition de la population (N, %) par niveau de défavorisation sociale 2021 de la région des Laurentides - secteur MRC/RLS d'Argenteuil","Environ un cinquième de la population de la MRC/RLS d’Argenteuil 5abitent des secteurs ayant les conditions sociales parmi les plus défavorables (quintile 5). Ces secteurs se répartissent dans Brownsburg-Chatham, Grenville et Lachute. \n\nMise à jour : janvier 2024"]
["770-1513","770-1513Matérielle et socialeRégional","Régional","Matérielle et sociale","A501:O512","A1:N4","J501:K512","A12:B15","A501:A512","MRC/RLS PDH","RLS_PDH_2016_Comb","A6","B2","B6","B2","A6","Dans la MRC/RLS des Pays-d’en-Haut, les secteurs ayant les conditions parmi les plus défavorables à la fois sur le plan matériel et social (profil 5 – en violet) sont localisés à Saint-Adolphe-d’Howard, Saint-Sauveur, Sainte-Adèle et à Sainte-Marguerite-du-Lac-Masson. \n\nPrès de la moitié des résidents de la MRC/RLS habite des secteurs où les conditions sont parmi les plus défavorables uniquement sur le plan social (profil 3 – en bleu). Ces derniers se retrouvent à Saint-Adolphe-d’Howard, Morin-Heights, Sainte-Adèle, Piedmont et Saint-Sauveur. La majorité de la population de Saint-Sauveur, Sainte-Adèle et Piedmont habite ces secteurs.\n\nOn retrouve des secteurs qui présentent les conditions parmi les plus défavorables seulement sur le plan matériel (profil 4 – en orangé) dans Wentworth-Nord, Saint-Adolphe-d’Howard et Sainte-Marguerite-du-Lac-Masson. Autour de la moitié des populations de Wentworth-Nord et de Sainte-Marguerite-du-Lac-Masson habite ces secteurs.\n\nMise à jour : janvier 2024","Dans la MRC/RLS des Pays-d’en-Haut, moins d’un dixième de la population habite des secteurs ayant les conditions parmi les plus défavorables de la MRC/RLS à la fois sur le plan matériel et social (profil 5). Ces derniers sont localisés à Saint-Adolphe-d’Howard, Sainte-Adèle, Sainte-Marguerite-du-Lac-Masson et Saint-Sauveur. \n\nPrès de la moitié de la population de la MRC/RLS habite des secteurs où les conditions sont parmi les plus défavorables uniquement sur le plan social (profil 3). Ces secteurs se retrouvent à Morin-Heights, Piedmont, Saint-Adolphe-d’Howard, Sainte-Adèle, et Saint-Sauveur. En nombre, Sainte-Adèle et Saint-Sauveur sont les municipalités ayant le plus de résidents qui habitent ces secteurs.\n\nMoins d’un dixième de la population de la MRC/RLS habite des secteurs qui présentent les conditions parmi les plus défavorables seulement sur le plan matériel (profil 4). Ces derniers se trouvent dans Saint-Adolphe-d’Howard, Sainte-Marguerite-du-Lac-Masson Sainte-Adèle, et Saint-Sauveur. Presque toute la population de Sainte-Marguerite-du-Lac-Masson et plus de la moitié de celle de Saint-Adolphe-d'Howard habitent ces secteurs.\n\nMise à jour : janvier 2024","En 2021 comme en 2016, on retrouve peu de secteurs dont les conditions sont parmi les plus défavorables à la fois sur le plan matériel et social (profil 5 – en violet) dans le RLS des Pays-d’en-Haut. uelques-uns sont passés du profil 5 en 2016 au profil 3 (à Sainte-Adèle) ou au profil 4 (à Sainte-Marguerite du-Lac-Masson) en 2021. \n\nÀ savoir - Les variations entre 2016 et 2021 ont plusieurs causes possibles. Elles peuvent être dues à des changements 1) dans la population des secteurs auxquels on réfère, 2) dans la population de l’ensemble du territoire auquel les secteurs sont comparés, ou encore 3) dans la compilation de l’indice, en raison, par exemple, des modifications du découpage des secteurs ou des données manquantes.\n\nMise à jour : février 2024","J3:O40","A22:K37","Répartition de la population selon les profils de défavorisation matérielle et sociale combinée 2021 de la région des Laurentides - secteur MRC/RLS des Pays-d'en-Haut","Source : INSPQ et BIESP, 2023. Statistique Canada, Recensement 2021.","A18","49.5","Population des secteurs ayant les conditions matérielles et sociales les plus défavorables - secteur MRC/RLS des Pays-d'en-Haut, 2021","Panorama de la défavorisation dans les Laurentides 2021, produit par l’équipe Surveillance, recherche et évaluation, Direction de santé publique des Laurentides, Centre intégré de santé et de services sociaux des Laurentides, 2024","A19","La population sans indice réside dans des secteurs où l’information pour le calcul de l’indice est indisponible à cause des ménages collectifs (centres d’hébergement, pénitenciers) ou du taux de non-réponse trop élevé.","A20","https://www.santelaurentides.gouv.qc.ca/sante-publique/donnees-sur-la-population/panorama-de-la-defavorisation/","A1:O18","A1:O17","Répartition de la population selon les profils de défavorisation matérielle et sociale combinée 2021 de la région des Laurentides - secteur MRC/RLS des Pays-d'en-Haut","Dans la MRC/RLS des Pays-d’en-Haut, moins d’un dixième de la population habite des secteurs ayant les conditions parmi les plus défavorables du territoire à la fois sur le plan matériel et social (profil 5). Ces derniers sont localisés à Saint-Adolphe-d’Howard, Sainte-Adèle, Sainte-Marguerite-du-Lac-Masson et Saint-Sauveur. \n\nMise à jour : janvier 2024"]
["770-1513","770-1513MatérielleRégional","Régional","Matérielle","A600:O611","A7:N9","J600:K611","A18:B20","A600:A611","MRC/RLS PDH","RLS_PDH_2016_Mat","A5","B2","B5","B2","A5","Dans la MRC/RLS des Pays-d’en-Haut, les secteurs ayant les conditions matérielles parmi les plus défavorables (quintile 5 – en orangé) sont à Wentworth-Nord, Saint-Adolphe-d’Howard, Sainte-Adèle et Sainte-Marguerite-du-Lac-Masson. Près de la moitié de la population de Wentworth-Nord habite ces secteurs. \n\nMise à jour : janvier 2024","Dans la MRC/RLS des Pays-d’en-Haut, les secteurs ayant les conditions matérielles parmi les plus défavorables (quintile 5) sont à Saint-Adolphe-d’Howard, Sainte-Adèle, Sainte-Marguerite-du-Lac-Masson et Wentworth-Nord. En nombre, c’est à Sainte-Adèle qu’on trouve le plus de personnes habitant ces secteurs. \n\nMise à jour : janvier 2024","Lorsqu’on se concentre sur l’évolution des secteurs se retrouvant dans le quintile 5 (en orangé), le plus défavorable matériellement, on constate quelques changements entre 2016 et 2021. Essentiellement, des secteurs sont passés du quintile 5 à des quintiles plus favorables dans Lac-des-Seize-Iles, Saint-Adolphe-d’Howard et Sainte-Marguerite du-Lac-Masson.\n\nÀ savoir - Les variations entre 2016 et 2021 ont plusieurs causes possibles. Elles peuvent être dues à des changements 1) dans la population des secteurs auxquels on réfère, 2) dans la population de l’ensemble du territoire auquel les secteurs sont comparés, ou encore 3) dans la compilation de l’indice, en raison, par exemple, des modifications du découpage des secteurs ou des données manquantes.\n\nMise à jour : février 2024","J3:O40","A21:K36","Répartition de la population (N, %) par niveau de défavorisation matérielle 2021 de la région des Laurentides - secteur MRC/RLS des Pays-d'en-Haut","Source : INSPQ et BIESP, 2023. Statistique Canada, Recensement 2021.","A17","16.5","Population des secteurs ayant les conditions matérielles les plus défavorables - secteur MRC/RLS des Pays-d'en-Haut, 2021","Panorama de la défavorisation dans les Laurentides 2021, produit par l’équipe Surveillance, recherche et évaluation, Direction de santé publique des Laurentides, Centre intégré de santé et de services sociaux des Laurentides, 2024","A18","La population sans indice réside dans des secteurs où l’information pour le calcul de l’indice est indisponible à cause des ménages collectifs (centres d’hébergement, pénitenciers) ou du taux de non-réponse trop élevé.","A19","https://www.santelaurentides.gouv.qc.ca/sante-publique/donnees-sur-la-population/panorama-de-la-defavorisation/","A1:O17","A1:O16","Répartition de la population (N, %) par niveau de défavorisation matérielle 2021 de la région des Laurentides - secteur MRC/RLS des Pays-d'en-Haut","Dans la MRC/RLS des Pays-d’en-Haut, les secteurs ayant les conditions matérielles parmi les plus défavorables (quintile 5) sont à Saint-Adolphe-d’Howard, Sainte-Adèle, Sainte-Marguerite-du-Lac-Masson et Wentworth-Nord. En nombre, c’est à Sainte-Adèle qu’on trouve le plus de personnes habitant ces secteurs. \n\nMise à jour : janvier 2024"]
["770-1513","770-1513SocialeRégional","Régional","Sociale","A699:O710","A7:N9","J699:K710","A18:B20","A699:A710","MRC/RLS PDH","RLS_PDH_2016_Soc","A5","B2","B5","B2","A5","Les secteurs de la MRC/RLS des Pays-d’en-Haut qui présentent les conditions sociales les plus défavorables (quintile 5 – en orangé) se retrouvent à Saint-Sauveur, Sainte-Adèle et Piedmont. On retrouve plus de la moitié de la population de la MRC dans les deux quintiles les plus défavorables regroupés (quintiles 4 – en orangé pâle et 5 – en orangé).\n\nMise à jour : janvier 2024","Environ un cinquième de la population de la MRC/RLS des Pays-d’en-Haut habitent des secteurs qui présentent les conditions sociales les plus défavorables (quintile 5). Ces secteurs se retrouvent à Piedmont, Sainte-Adèle et à Saint-Sauveur. Plus des du tiers de la population de Piedmont et de Sainte-Adèle habite ces secteurs.\n\nMise à jour : janvier 2024","Si on se concentre sur les secteurs ayant les conditions parmi les plus défavorables socialement (quintile 5 - en orangé), on constate que quelques qui étaient de quintiles 4 en 2016 sont passés au quintile 5 en 2021. Ces secteurs se situent à Saint-Sauveur et à Piedmont. À l’inverse, d’autres secteurs sont passés du quintile 5 en 2016 à des quintiles plus favorables en 2021 dans Sainte-Marguerite-du-Lac-Masson et Saint-Sauveur. \n\nÀ savoir - Les variations entre 2016 et 2021 ont plusieurs causes possibles. Elles peuvent être dues à des changements 1) dans la population des secteurs auxquels on réfère, 2) dans la population de l’ensemble du territoire auquel les secteurs sont comparés, ou encore 3) dans la compilation de l’indice, en raison, par exemple, des modifications du découpage des secteurs ou des données manquantes.\n\nMise à jour : février 2024","J3:O40","A21:K36","Répartition de la population (N, %) par niveau de défavorisation sociale 2021 de la région des Laurentides - secteur MRC/RLS des Pays-d'en-Haut","Source : INSPQ et BIESP, 2023. Statistique Canada, Recensement 2021.","A17","16.5","Population des secteurs ayant les conditions sociales les plus défavorables - secteur MRC/RLS des Pays-d'en-Haut, 2021","Panorama de la défavorisation dans les Laurentides 2021, produit par l’équipe Surveillance, recherche et évaluation, Direction de santé publique des Laurentides, Centre intégré de santé et de services sociaux des Laurentides, 2024","A18","La population sans indice réside dans des secteurs où l’information pour le calcul de l’indice est indisponible à cause des ménages collectifs (centres d’hébergement, pénitenciers) ou du taux de non-réponse trop élevé.","A19","https://www.santelaurentides.gouv.qc.ca/sante-publique/donnees-sur-la-population/panorama-de-la-defavorisation/","A1:O17","A1:O16","Répartition de la population (N, %) par niveau de défavorisation sociale 2021 de la région des Laurentides - secteur MRC/RLS des Pays-d'en-Haut","Environ un cinquième de la population de la MRC/RLS des Pays-d’en-Haut habitent des secteurs qui présentent les conditions sociales les plus défavorables (quintile 5). Ces secteurs se retrouvent à Piedmont, Sainte-Adèle et à Saint-Sauveur. Plus du tiers de la population de Piedmont et de Sainte-Adèle habite ces secteurs. Mise à jour : janvier 2024"]
["780-1512","780-1512Matérielle et socialeRégional","Régional","Matérielle et sociale","A513:O534","A1:N4","J513:K534","A12:B15","A513:A534","MRC/RLS Laurentides","RLS_LAUR_2016_Comb","A6","B2","B6","B2","A6","Dans la MRC/RLS des Laurentides, on retrouve des secteurs ayant les conditions parmi les plus défavorables à la fois sur le plan matériel et social (profil 5 – en violet) à Labelle, Amherst, Brébeuf, Arundel, Huberdeau, Mont-Tremblant, Sainte-Agathe-des-Monts, Val-David et à Val-Morin. Mont-Tremblant et Sainte-Agathe-des-Monts se démarquent avec le plus grand nombre de personnes habitant ces secteurs.\n\nLes secteurs où les conditions sont parmi les plus défavorables de la MRC/RLS uniquement sur le plan social (profil 3 – en bleu) se situent à Mont-Tremblant, Mont-Blanc, Sainte-Agathe-des-Monts et Val-David. C’est à Val-David qu’on retrouve le plus grand nombre de personnes qui habitent ces secteurs. \n\nLes secteurs qui présentent les conditions parmi les plus défavorables de la MRC/RLS seulement sur le plan matériel (profil 4 – en orangé) se situent à La Minerve, Labelle, La Conception, Amherst, Brébeuf, Lac-Supérieur, Val-des-Lacs, Lanthier, Mont-Blanc, Sainte-Agathe-des-Monts et Sainte-Lucie-des-Laurentides.\n\nMise à jour : janvier 2024","Près du tiers de la population de la MRC/RLS des Laurentides, on retrouve des secteurs ayant les conditions parmi les plus défavorables à la fois sur le plan matériel et social (profil 5). Ces secteurs se siteunt à Amherst, Arundel, Brébeuf, Huberdeau, Labelle, Mont-Tremblant, Sainte-Agathe-des-Monts,  Mont-Blanc et à Val-Morin. Près de la moitié de la population de Mont-Tremblant et le tiers de celle de Sainte-Agathe-des-Monts habitent dans ces secteurs.\n\nEnviron un cinquième de la population de la MRC/RLS habite les secteurs où les conditions sont parmi les plus défavorables uniquement sur le plan social (profil 3). Ces derniers se situent à Mont-Blanc, Mont-Tremblant, Sainte-Agathe-des-Monts et Val-David. C’est à Val-David qu’on retrouve le plus grand nombre de personnes qui résident dans ces secteurs\n\nPlus du quart de la population de la MRC/RLS habite les secteurs où les conditions sont parmi les plus défavorables seulement sur le plan matériel (profil 4). Ces secteurs se situent à Amherst, Brébeuf, La Conception, La Minerve, Labelle, Lac Supéreur, Mont-Blanc, Lanthier, Sainte-Agathe-des-Monts, Sainte-Lucie-des-Laurentides et Val-des-Lacs. L’ensemble de la population Amherst et de Lanthier habite ces secteurs.\n\nMise à jour : janvier 2024","Lorsqu’on se concentre sur l’évolution des secteurs du profil 5 (violet), soit ceux ayant les conditions matérielles et sociales parmi les plus défavorables, on voit que certains secteurs sont passés d’un profil 4 (défavorisation matérielle seulement) en 2016 au profil 5 en 2021. On remarque ces changements dans Huberdeau, Arundel, Brébeuf et Mont-Tremblant. À l’inverse, des secteurs de profil 5 sont devenus de profil 3 à Mont-Blanc ou de profil 4 à Labelle.\n\nÀ savoir - Les variations entre 2016 et 2021 ont plusieurs causes possibles. Elles peuvent être dues à des changements 1) dans la population des secteurs auxquels on réfère, 2) dans la population de l’ensemble du territoire auquel les secteurs sont comparés, ou encore 3) dans la compilation de l’indice, en raison, par exemple, des modifications du découpage des secteurs ou des données manquantes.\n\nMise à jour : février 2024","J3:O40","A32:K46","Répartition de la population selon les profils de défavorisation matérielle et sociale combinée 2021 de la région des Laurentides - secteur MRC/RLS des Laurentides","Source : INSPQ et BIESP, 2023. Statistique Canada, Recensement 2021.","A28","49.5","Population des secteurs ayant les conditions matérielles et sociales les plus défavorables - secteur MRC/RLS des Laurentides, 2021","Panorama de la défavorisation dans les Laurentides 2021, produit par l’équipe Surveillance, recherche et évaluation, Direction de santé publique des Laurentides, Centre intégré de santé et de services sociaux des Laurentides, 2024","A29","La population sans indice réside dans des secteurs où l’information pour le calcul de l’indice est indisponible à cause des ménages collectifs (centres d’hébergement, pénitenciers) ou du taux de non-réponse trop élevé.","A30","https://www.santelaurentides.gouv.qc.ca/sante-publique/donnees-sur-la-population/panorama-de-la-defavorisation/","A1:O29","A1:O28","Répartition de la population selon les profils de défavorisation matérielle et sociale combinée 2021 de la région des Laurentides - secteur MRC/RLS des Laurentides","Près du tiers de la population de la MRC/RLS des Laurentides, on retrouve des secteurs ayant les conditions parmi les plus défavorables à la fois sur le plan matériel et social (profil 5). Ces secteurs se siteunt à Amherst, Arundel, Brébeuf, Huberdeau, Labelle, Mont-Tremblant, Sainte-Agathe-des-Monts, Mont-Blanc et à Val-Morin. Près de la moitié de la population de Mont-Tremblant et le tiers de celle de Sainte-Agathe-des-Monts habitent dans ces secteurs.\n\nMise à jour : janvier 2024"]
["780-1512","780-1512MatérielleRégional","Régional","Matérielle","A612:O633","A7:N9","J612:K633","A18:B20","A612:A633","MRC/RLS Laurentides","RLS_LAUR_2016_Mat","A5","B2","B5","B2","A5","Dans la MRC/RLS des Laurentides, les secteurs ayant les conditions matérielles parmi les plus défavorables (quintile 5 – en orangé) sont localisés Labelle, La Conception, Amherst, Brébeuf, Huberdeau, Mont-Tremblant, Lac-Supérieur, Mont-Blanc, Sainte-Agathe-des-Monts, Lanthier et Sainte-Lucie-des-Laurentides. En nombre de personnes, Sainte-Agathe-des-Monts est de loin la municipalité où la population habitant ces secteurs est la plus importante. \n\nMise à jour : janvier 2024","Environ le quart de la population de la MRC/RLS des Laurentides habite des secteurs ayant les conditions matérielles parmi les plus défavorables (quintile 5). Ces derniers sont localisés à Amherst, Brébeuf, Huberdeau, La Conception, Labelle, Lac-Supérieur, Lanthier, Mont-Blanc, Mont-Tremblant, Sainte-Agathe-des-Monts et à Sainte-Lucie-des-Laurentides. En nombre de personnes, Sainte-Agathe-des-Monts est de loin la municipalité où la population habitant ces secteurs est la plus importante. \n\nMise à jour : janvier 2024","Lorsqu’on se concentre sur l’évolution des secteurs ayant les conditions les plus défavorables matériellement (quintile 5 – en orangé) de la région des Laurentides, on constate que certains secteurs sont passés d’un quintile 3 ou 4 en 2016 au quintile 5 en 2021. Ces secteurs se trouvent dans La Conception, Huberdeau, Mont-Blanc et Lac-Supérieur. À l’inverse, d’autres secteurs qui étaient de quintiles 5 en 2016 sont passés à un quintile favorable, en 2021. Ils se situent à La Minerve, Montcalm et Val-des-Lacs.\n\nÀ savoir - Les variations entre 2016 et 2021 ont plusieurs causes possibles. Elles peuvent être dues à des changements 1) dans la population des secteurs auxquels on réfère, 2) dans la population de l’ensemble du territoire auquel les secteurs sont comparés, ou encore 3) dans la compilation de l’indice, en raison, par exemple, des modifications du découpage des secteurs ou des données manquantes.\n\nMise à jour : février 2024","J3:O40","A31:K45","Répartition de la population (N, %) par niveau de défavorisation matérielle 2021 de la région des Laurentides - secteur MRC/RLS des Laurentides","Source : INSPQ et BIESP, 2023. Statistique Canada, Recensement 2021.","A27","16.5","Population des secteurs ayant les conditions matérielles les plus défavorables - secteur MRC/RLS des Laurentides, 2021","Panorama de la défavorisation dans les Laurentides 2021, produit par l’équipe Surveillance, recherche et évaluation, Direction de santé publique des Laurentides, Centre intégré de santé et de services sociaux des Laurentides, 2024","A28","La population sans indice réside dans des secteurs où l’information pour le calcul de l’indice est indisponible à cause des ménages collectifs (centres d’hébergement, pénitenciers) ou du taux de non-réponse trop élevé.","A29","https://www.santelaurentides.gouv.qc.ca/sante-publique/donnees-sur-la-population/panorama-de-la-defavorisation/","A1:O28","A1:O27","Répartition de la population (N, %) par niveau de défavorisation matérielle 2021 de la région des Laurentides - secteur MRC/RLS des Laurentides","Environ le quart de la population de la MRC/RLS des Laurentides habite des secteurs ayant les conditions matérielles parmi les plus défavorables (quintile 5). Ces derniers sont localisés à Amherst, Brébeuf, Huberdeau, La Conception, Labelle, Lac-Supérieur, Lanthier, Mont-Blanc, Mont-Tremblant, Sainte-Agathe-des-Monts et à Sainte-Lucie-des-Laurentides. En nombre de personnes, Sainte-Agathe-des-Monts est de loin la municipalité où la population habitant ces secteurs est la plus importante. \n\nMise à jour : janvier 2024"]
["780-1512",{"$f":"A73&D73&C73","v":"780-1512SocialeRégional"},"Régional","Sociale","A711:O732","A7:N9","J711:K732","A18:B20","A711:A732","MRC/RLS Laurentides","RLS_LAUR_2016_Soc","A5","B2","B5","B2","A5","Dans la MRC/RLS des Laurentides, les secteurs ayant les conditions sociales parmi les plus défavorables (quintile 5 – en orangé) sont localisés à Mont-Tremblant, Arundel, Mont-Blanc, Sainte-Agathe-des-Monts, Val-David et Val-Morin. En nombre de personnes, Mont-Tremblant et  Sainte-Agathe-des-Monts sont les municipalités où la population habitant ces secteurs est la plus importante. \n\nMise à jour : janvier 2024","Plus d’un cinquième de la population de la MRC/RLS des Laurentides, les secteurs réside dans des secteurs ayant les conditions sociales parmi les plus défavorables (quintile 5). Ces secteurs sont localisés à Arundel, Mont-Blanc, Mont-Tremblant, Sainte-Agathe-des-Monts, Val-David et Val-Morin. En nombre de personnes, Sainte-Agathe-des-Monts, Val-David et Mont-Tremblant sont les municipalités où la population habitant ces secteurs est la plus.\nMise à jour : janvier 2024","Si on se concentre sur les secteurs ayant les conditions sociales les plus défavorables (quintile 5 – en orangé), on remarque que certains secteurs sont passés d’un quintile 4 en 2016 au quintile 5 en 2021 dans Mont-Tremblant, Sainte-Agathe-des-Monts et Val-Morin.\n\nÀ savoir - Les variations entre 2016 et 2021 ont plusieurs causes possibles. Elles peuvent être dues à des changements 1) dans la population des secteurs auxquels on réfère, 2) dans la population de l’ensemble du territoire auquel les secteurs sont comparés, ou encore 3) dans la compilation de l’indice, en raison, par exemple, des modifications du découpage des secteurs ou des données manquantes.\n\nMise à jour : février 2024","J3:O40","A31:K45","Répartition de la population (N, %) par niveau de défavorisation sociale 2021 de la région des Laurentides - secteur MRC/RLS des Laurentides","Source : INSPQ et BIESP, 2023. Statistique Canada, Recensement 2021.","A27","16.5","Population des secteurs ayant les conditions sociales les plus défavorables - secteur MRC/RLS des Laurentides, 2021","Panorama de la défavorisation dans les Laurentides 2021, produit par l’équipe Surveillance, recherche et évaluation, Direction de santé publique des Laurentides, Centre intégré de santé et de services sociaux des Laurentides, 2024","A28","La population sans indice réside dans des secteurs où l’information pour le calcul de l’indice est indisponible à cause des ménages collectifs (centres d’hébergement, pénitenciers) ou du taux de non-réponse trop élevé.","A29","https://www.santelaurentides.gouv.qc.ca/sante-publique/donnees-sur-la-population/panorama-de-la-defavorisation/","A1:O28","A1:O27","Répartition de la population (N, %) par niveau de défavorisation sociale 2021 de la région des Laurentides - secteur MRC/RLS des Laurentides","Plus d’un cinquième de la population de la MRC/RLS des Laurentides, les secteurs réside dans des secteurs ayant les conditions sociales parmi les plus défavorables (quintile 5). Ces secteurs sont localisés à Arundel, Mont-Blanc, Mont-Tremblant, Sainte-Agathe-des-Monts, Val-David et Val-Morin. En nombre de personnes, Sainte-Agathe-des-Monts, Val-David et Mont-Tremblant sont les municipalités où la population habitant ces secteurs est la plus.\n\nMise à jour : janvier 2024"]
["790-1511","790-1511Matérielle et socialeRégional","Régional","Matérielle et sociale","A535:O554","A1:N4","J535:K554","A12:B15","A535:A554","MRC/RLS AL","RLS_AL_2016_Comb","A6","B2","B6","B2","A6","Dans la MRC/RLS d’Antoine-Labelle, les secteurs ayant les conditions parmi les plus défavorables de la région à la fois sur le plan matériel et social (profil 5 – en violet) sont localisés à Ferme-Neuve (très petit secteur sur la carte), Mont-Laurier, Lac-des-Écorces et à Rivière-Rouge.\n\nOn retrouve un seul secteur de la MRC/RLS d’Antoine-Labelle qui présente les conditions parmi les plus défavorables de la région sur le plan social uniquement (profil 3 – en bleu), qui se situe à Mont-Laurier (petit secteur sur la carte). Celle-ci est de loin la municipalité où la taille de la population habitant ces secteurs est la plus importante.\n\nOn retrouve des secteurs ayant les conditions parmi les plus défavorables de la région sur le plan matériel seulement (profil 4 – en orangé) dans toutes les municipalités de la MRC/RLS.\n\nMise à jour : janvier 2024","Dans la MRC/RLS d’Antoine-Labelle, les secteurs ayant les conditions parmi les plus défavorables à la fois sur le plan matériel et social (profil 5) sont localisés à Rivière-Rouge, Nominingue, Lac-des-Écorces, Ferme-Neuve et à Mont-Laurier.\n\nLes secteurs ayant les conditions parmi les plus défavorables sur le plan social uniquement (profil 3) se retrouvent tous à Mont-Laurier. \n\nOn retrouve des secteurs ayant les conditions parmi les plus défavorables sur le plan matériel seulement (profil 4) dans toutes les municipalités du territoire. Les municipalités où on retrouve le plus grand nombre de résidents dans ces secteurs sont Mont-Laurier, Rivière-Rouge, Ferme-Neuve et Lac-des-Écorces. \n\nMise à jour : janvier 2024","La majeure partie des secteurs de la MRC/RLS Antoine-Labelle sont de profil 4 (défavorisation matérielle seulement - en orangé). Lorsqu’on se concentre sur l’évolution des secteurs du profil 5 (violet), soit ceux ayant les conditions matérielles et sociales parmi les plus défavorables, on remarque que certains secteurs sont passés d’un profil 4 en 2016 au profil 5 en 2021 dans Lac-des-Écorces. À l’inverse, des secteurs de profil 5 sont devenus de profil 4 à La Macaza.\n\nÀ savoir - Les variations entre 2016 et 2021 ont plusieurs causes possibles. Elles peuvent être dues à des changements 1) dans la population des secteurs auxquels on réfère, 2) dans la population de l’ensemble du territoire auquel les secteurs sont comparés, ou encore 3) dans la compilation de l’indice, en raison, par exemple, des modifications du découpage des secteurs ou des données manquantes.\n\nMise à jour : février 2024","J3:O40","A30:K44","Répartition de la population selon les profils de défavorisation matérielle et sociale combinée 2021 de la région des Laurentides - secteur MRC/RLS d'Antoine-Labelle","Source : INSPQ et BIESP, 2023. Statistique Canada, Recensement 2021.","A26","49.5","Population des secteurs ayant les conditions matérielles et sociales les plus défavorables - secteur MRC/RLS d'Antoine-Labelle, 2021","Panorama de la défavorisation dans les Laurentides 2021, produit par l’équipe Surveillance, recherche et évaluation, Direction de santé publique des Laurentides, Centre intégré de santé et de services sociaux des Laurentides, 2024","A27","La population sans indice réside dans des secteurs où l’information pour le calcul de l’indice est indisponible à cause des ménages collectifs (centres d’hébergement, pénitenciers) ou du taux de non-réponse trop élevé.","A28","https://www.santelaurentides.gouv.qc.ca/sante-publique/donnees-sur-la-population/panorama-de-la-defavorisation/","A1:O27","A1:O26","Répartition de la population selon les profils de défavorisation matérielle et sociale combinée 2021 de la région des Laurentides - secteur MRC/RLS d'Antoine-Labelle","Dans la MRC/RLS d’Antoine-Labelle, les secteurs ayant les conditions parmi les plus défavorables à la fois sur le plan matériel et social (profil 5) sont localisés à Rivière-Rouge, à Nominingue, à Lac-des-Écorces, à Ferme-Neuve et à Mont-Laurier.\n\nMise à jour : janvier 2024 "]
["790-1511","790-1511MatérielleRégional","Régional","Matérielle","A634:O653","A7:N9","J634:K653","A18:B20","A634:A653","MRC/RLS AL","RLS_AL_2016_Mat","A5","B2","B5","B2","A5","Dans la MRC/RLS d’Antoine-Labelle, on retrouve les secteurs ayant les conditions matérielles les plus défavorables (quintile 5 – en orangé) dans toutes les municipalités. Pour la majorité d’entre elles (10 sur 17 municipalité), la totalité de leur territoire est composé de secteurs aux conditions plus défavorables. Mont-Laurier présente une répartition sensiblement plus diversifiée.\n\nMise à jour : janvier 2024","Plus des deux-tiers de la population de la MRC/RLS d’Antoine-Labelle habitent les secteurs ayant les conditions matérielles parmi les plus défavorables (quintile 5). On retrouve ces secteurs dans toutes les municipalités du territoire. En nombre de personnes, Mont-Laurier, Rivière-Rouge, Ferme-Neuve et Lac-des-Écorces sont les municipalités où les populations habitant ces secteurs sont les plus importantes.\n\nMise à jour : janvier 2024","Lorsqu’on se concentre sur l’évolution des secteurs se retrouvant dans des conditions parmi les plus défavorables matériellement (quintile 5 – en orangé) de la région des Laurentides, on constate que certains secteurs sont passés d’un quintile 3 ou 4 en 2016 au quintile 5 en 2021, dans Lac-des-Écorces, Nominingue, Rivière-Rouge et La Macaza. À l’inverse, d’autres secteurs qui étaient de quintile 5 en 2016 sont passés à un quintile plus favorables en 2021. Ces secteurs se situent à Ferme-Neuve, Mont-Laurier, Lac-des-Écorces, Rivière-Rouge et Notre-Dame-du-Laus.\n\nÀ savoir - Les variations entre 2016 et 2021 ont plusieurs causes possibles. Elles peuvent être dues à des changements 1) dans la population des secteurs auxquels on réfère, 2) dans la population de l’ensemble du territoire auquel les secteurs sont comparés, ou encore 3) dans la compilation de l’indice, en raison, par exemple, des modifications du découpage des secteurs ou des données manquantes.\n\nMise à jour : février 2024","J3:O40","A29:K43","Répartition de la population (N, %) par niveaul de défavorisation matérielle 2021 de la région des Laurentides - secteur MRC/RLS d'Antoine-Labelle","Source : INSPQ et BIESP, 2023. Statistique Canada, Recensement 2021.","A25","16.5","Population des secteurs ayant les conditions matérielles les plus défavorables - secteur MRC/RLS d'Antoine-Labelle, 2021","Panorama de la défavorisation dans les Laurentides 2021, produit par l’équipe Surveillance, recherche et évaluation, Direction de santé publique des Laurentides, Centre intégré de santé et de services sociaux des Laurentides, 2024","A26","La population sans indice réside dans des secteurs où l’information pour le calcul de l’indice est indisponible à cause des ménages collectifs (centres d’hébergement, pénitenciers) ou du taux de non-réponse trop élevé.","A27","https://www.santelaurentides.gouv.qc.ca/sante-publique/donnees-sur-la-population/panorama-de-la-defavorisation/","A1:O26","A1:O25","Répartition de la population (N, %) par niveau de défavorisation matérielle 2021 de la région des Laurentides - secteur MRC/RLS d'Antoine-Labelle","Plus des deux-tiers de la population de la MRC/RLS d’Antoine-Labelle habitent les secteurs ayant les conditions matérielles parmi les plus défavorables (quintile 5). On retrouve ces secteurs dans toutes les municipalités du territoire. En nombre de personnes, Mont-Laurier, Rivière-Rouge, Ferme-Neuve et Lac-des-Écorces sont les municipalités où les populations habitant ces secteurs sont les plus importantes.\n\nMise à jour : janvier 2024 "]
["790-1511","790-1511SocialeRégional","Régional","Sociale","A733:O752","A7:N9","J733:K752","A18:B20","A733:A752","MRC/RLS AL","RLS_AL_2016_Soc","A5","B2","B5","B2","A5","Dans la MRC/RLS d’Antoine-Labelle, on retrouve les secteurs ayant les conditions sociales parmi les plus défavorables (quintile 5 – en orangé) uniquement à Mont-Laurier et à Rivière-Rouge. En nombre de personnes, Mont-Laurier est de loin la municipalité où la population habitant ces secteurs est la plus importante (1 600 personnes). Toutes les municipalités du territoire, SAUF La MAcaza, Lac Saguay et Sainte-Anne-du-Lac, ont des secteurs où les conditions sont les plus favorables (quintile 1 – en vert foncé et quintile 2 – en vert pâle).\n\nMise à jour : janvier 2024","Dans la MRC/RLS d’Antoine-Labelle, à peine plus d’une personne sur 20 habite des secteurs ayant les conditions sociales parmi les plus défavorables (quintile 5). On retrouve ces secteurs à Mont-Laurier et à Rivière-Rouge.\n\nMise à jour : janvier 2024","La MRC/RLS Antoine-Labelle présente un profil particulièrement favorable comparé à l’ensemble de la région des Laurentides en matière de défavorisation sociale. Lorsqu’on se concentre sur l’évolution des secteurs se retrouvant dans des conditions parmi les plus défavorables socialement (quintile 5 – en orangé), on constate que certains secteurs sont passés d’un quintile 3 ou 4 en 2016 au quintile 5 en 2021, Mont-Laurier et à Rivière-Rouge. \n\nÀ savoir - Les variations entre 2016 et 2021 ont plusieurs causes possibles. Elles peuvent être dues à des changements 1) dans la population des secteurs auxquels on réfère, 2) dans la population de l’ensemble du territoire auquel les secteurs sont comparés, ou encore 3) dans la compilation de l’indice, en raison, par exemple, des modifications du découpage des secteurs ou des données manquantes.\n\nMise à jour : février 2024","J3:O40","A29:K43","Répartition de la population (N, %) par niveau de défavorisation sociale 2021 de la région des Laurentides - secteur MRC/RLS d'Antoine-Labelle","Source : INSPQ et BIESP, 2023. Statistique Canada, Recensement 2021.","A25","16.5","Population des secteurs ayant les conditions sociales les plus défavorables - secteur MRC/RLS d'Antoine-Labelle, 2021","Panorama de la défavorisation dans les Laurentides 2021, produit par l’équipe Surveillance, recherche et évaluation, Direction de santé publique des Laurentides, Centre intégré de santé et de services sociaux des Laurentides, 2024","A26","La population sans indice réside dans des secteurs où l’information pour le calcul de l’indice est indisponible à cause des ménages collectifs (centres d’hébergement, pénitenciers) ou du taux de non-réponse trop élevé.","A27","https://www.santelaurentides.gouv.qc.ca/sante-publique/donnees-sur-la-population/panorama-de-la-defavorisation/","A1:O26","A1:O25","Répartition de la population (N, %) par niveau de défavorisation sociale 2021 de la région des Laurentides - secteur MRC/RLS d'Antoine-Labelle","Dans la MRC/RLS d’Antoine-Labelle, à peine plus d’une personne sur 20 habite des secteurs ayant les conditions sociales parmi les plus défavorables (quintile 5). On retrouve ces secteurs à Mont-Laurier et à Rivière-Rouge.\n\nMise à jour : janvier 2024 "]
[1515,"1515Matérielle et socialeRégional","Régional","Matérielle et sociale","A767:O776","A1:N4","J767:K776","A12:B15","A767:A776","RLS DM","RLS_DM_2016_Comb","A6","B2","B6","B2","A6","Dans le RLS de Deux-Montagnes-Mirabel-Sud, les secteurs ayant des conditions parmi les plus défavorables de la MRC à la fois sur le plan matériel et social (profil 5 – en violet) sont localisés à Mirabel, Pointe-Calumet, Sainte-Marthe-sur-le-Lac, Deux-Montagnes et à Saint-Eustache.\n\nLes secteurs où les conditions sont les plus défavorables du RLS seulement sur le plan social (profil 3 – en bleu) se retrouvent dans toutes les municipalités de la MRC, SAUF à Saint-Placide (à noter qu’il s’agit de très petits secteurs dans Oka et Pointe-Calumet).\n\nOn retrouve des secteurs qui présentent les conditions les plus défavorables du RLS seulement sur le plan matériel (profil 4 – en orangé) dans toutes les municipalités du territoire. Plus de la moitié de la population de Pointe-Calumet et près de la moitié de celle de Saint-Joseph-du-Lac résident dans ces secteurs.\n\nMise à jour : janvier 2024","Plus d’un résident sur dix du RLS Deux-Montagnes-Mirabel-Sud habitent un secteur ayant des conditions parmi les plus défavorables à la fois sur le plan matériel et social (profil 5). Ces secteurs sont localisés à Deux-Montagnes, Mirabel, Pointe-Calumet, Sainte-Marthe-sur-le-Lac et à Saint-Eustache. À Pointe-Calumet, plus du tiers de la population habite dans ces secteurs.\n\nEnviron un cinquième de la population du RLS habitent des secteurs où les conditions sont parmi les plus défavorables seulement sur le plan social (profil 3). On retrouve de ces secteurs dans toutes les municipalités SAUF Saint-Placide. Pointe-Calumet compte moins d’un résident sur dix qui habite un secteur de profil 3. Plus du tiers de la population de la municipalité de Deux-Montagnes et de Mirabel habite dans ces secteurs.\n\nEnviron un cinquième de la population du RLS résident des secteurs où les conditions sont parmi les plus défavorables seulement sur le plan matériel (profil 4). Ces derniers se retrouvent dans toutes les municipalités du territoire. Environ la moitié de la population de de Pointe-Calumet, de Saint-Placide et de Saint-Joseph-du-Lac réside dans ces secteurs.\n\nMise à jour : janvier 2024","Lorsqu’on se concentre sur l’évolution des secteurs du profil 5 (violet), soit ceux ayant les conditions matérielles et sociales parmi les plus défavorables, on remarque peu de changement en 2021 par rapport à 2016. Certains secteurs de profil 5 se sont ajoutés à Sainte-Marthe-sur-le-Lac, Deux-Montagnes et Saint-Eustache. D’autres sont passés à un profil plus favorable dans ces trois mêmes municipalités, ainsi qu’à Saint-Placide et Mirabel.\n\nÀ savoir - Les variations entre 2016 et 2021 ont plusieurs causes possibles. Elles peuvent être dues à des changements 1) dans la population des secteurs auxquels on réfère, 2) dans la population de l’ensemble du territoire auquel les secteurs sont comparés, ou encore 3) dans la compilation de l’indice, en raison, par exemple, des modifications du découpage des secteurs ou des données manquantes. \n\nMise à jour : février 2024","J3:O40","A20:K35","Répartition de la population selon les profils de défavorisation matérielle et sociale combinée 2021 de la région des Laurentides - secteur RLS de Deux-Montagnes - Mirabel-Sud","Source : INSPQ et BIESP, 2023. Statistique Canada, Recensement 2021.","A16","49.5","Population des secteurs ayant les conditions matérielles et sociales les plus défavorables - secteur RLS de Deux-Montagnes - Mirabel-Sud, 2021","Panorama de la défavorisation dans les Laurentides 2021, produit par l’équipe Surveillance, recherche et évaluation, Direction de santé publique des Laurentides, Centre intégré de santé et de services sociaux des Laurentides, 2024","A17","La population sans indice réside dans des secteurs où l’information pour le calcul de l’indice est indisponible à cause des ménages collectifs (centres d’hébergement, pénitenciers) ou du taux de non-réponse trop élevé.","A18","https://www.santelaurentides.gouv.qc.ca/sante-publique/donnees-sur-la-population/panorama-de-la-defavorisation/","A1:O16","A1:O14","Répartition de la population selon les profils de défavorisation matérielle et sociale combinée 2021 de la région des Laurentides - secteur RLS de Deux-Montagnes - Mirabel-Sud","Plus d’un résident sur dix du RLS Deux-Montagnes-Mirabel-Sud habitent un secteur ayant des conditions parmi les plus défavorables à la fois sur le plan matériel et social (profil 5). Ces secteurs sont localisés à Deux-Montagnes, Mirabel, Pointe-Calumet, Sainte-Marthe-sur-le-Lac et à Saint-Eustache. À Pointe-Calumet, plus du tiers de la population habite dans ces secteurs.\n\nMise à jour : janvier 2024"]
[1515,"1515MatérielleRégional","Régional","Matérielle","A791:O800","A7:N9","J791:K800","A18:B20","A791:A800","RLS DM","RLS_DM_2016_Mat","A5","B2","B5","B2","A5","Dans le RLS de Deux-Montagnes-Mirabel-Sud, on retrouve des secteurs ayant les conditions matérielles les plus défavorables (quintile 5 – en orangé) dans toutes les municipalités. \n\nPrès du tiers de la population de Pointe-Calumet et plus du quart de celle de Saint-Placide habitent ces secteurs. Si on regroupe les deux quintiles les plus défavorables (quintile 4 – en orangé pâle et quintile 5 – en orangé), on retrouvera plus de 9 résidents sur 10 de Pointe-Calumet et plus de la moitié de ceux de Saint-Placide et Saint-Eustache habitant ces secteurs.\n\nMise à jour : janvier 2024","Dans le RLS Deux-Montagnes-Mirabel-Sud, on retrouve des secteurs ayant les conditions matérielles parmi les plus défavorables (quintile 5) dans toutes les municipalités. Près du tiers de la population de Pointe-Calumet et plus du quart de celle de Saint-Placide habitent ces secteurs.\n\nMise à jour : janvier 2024","Lorsqu’on se concentre sur l’évolution des secteurs se retrouvant dans des conditions parmi les plus défavorables matériellement (quintile 5 – en orangé), on constate que certains secteurs sont passés d’un quintile 3 ou 4 en 2016 au quintile 5 en 2021. Ces secteurs se trouvent dans Mirabel, Saint-Placide, Saint-Joseph-du-Lac et Saint-Eustache. À l’inverse, d’autres secteurs de Saint-Placide et de Saint-Eustache et des secteurs de Sainte-Marthe-sur-le-Lac sont passés d’un quintile 5 en 2016 à des quintiles plus favorisés en 2021.\n\nÀ savoir - Les variations entre 2016 et 2021 ont plusieurs causes possibles. Elles peuvent être dues à des changements 1) dans la population des secteurs auxquels on réfère, 2) dans la population de l’ensemble du territoire auquel les secteurs sont comparés, ou encore 3) dans la compilation de l’indice, en raison, par exemple, des modifications du découpage des secteurs ou des données manquantes.\n\nMise à jour : février 2024","J3:O40","A19:K34","Répartition de la population (N, %) par niveau de défavorisation matérielle 2021 de la région des Laurentides - secteur RLS de Deux-Montagnes - Mirabel-Sud","Source : INSPQ et BIESP, 2023. Statistique Canada, Recensement 2021.","A15","16.5","Population des secteurs ayant les conditions matérielles les plus défavorables - secteur RLS de Deux-Montagnes - Mirabel-Sud, 2021","Panorama de la défavorisation dans les Laurentides 2021, produit par l’équipe Surveillance, recherche et évaluation, Direction de santé publique des Laurentides, Centre intégré de santé et de services sociaux des Laurentides, 2024","A16","La population sans indice réside dans des secteurs où l’information pour le calcul de l’indice est indisponible à cause des ménages collectifs (centres d’hébergement, pénitenciers) ou du taux de non-réponse trop élevé.","A17","https://www.santelaurentides.gouv.qc.ca/sante-publique/donnees-sur-la-population/panorama-de-la-defavorisation/","A1:O15","A1:O13","Répartition de la population (N, %) par niveau de défavorisation matérielle 2021 de la région des Laurentides - secteur RLS de Deux-Montagnes - Mirabel-Sud","Dans le RLS Deux-Montagnes-Mirabel-Sud, on retrouve des secteurs ayant les conditions matérielles parmi les plus défavorables (quintile 5) dans toutes les municipalités. Près du tiers de la population de Pointe-Calumet et plus du quart de celle de Saint-Placide habitent ces secteurs.\n\nMise à jour : janvier 2024"]
[1515,{"$f":"A79&D79&C79","v":"1515SocialeRégional"},"Régional","Sociale","A815:O824","A7:N9","J815:K824","A18:B20","A815:A824","RLS DM","RLS_DM_2016_Soc","A5","B2","B5","B2","A5","Dans le RLS de Deux-Montagnes-Mirabel-Sud, les secteurs ayant les conditions sociales les plus défavorables (quintile 5 – en orangé) se répartissent dans Mirabel, Pointe-Calumet, la municipalité de Deux-Montagnes et Saint-Eustache. En nombre, Saint-Eustache se démarque avec 10 600 personnes qui résident dans ces secteurs. \n\nMise à jour : janvier 2024","Dans le RLS Deux-Montagnes-Mirabel-Sud, les secteurs ayant les conditions sociales parmi les plus défavorables (quintile 5) se répartissent dans les municipalités de Deux-Montagnes, Mirabel, Pointe-Calumet et Saint-Eustache. Environ le tiers de la population de la municipalité de Deux-Montagnes et le quart de celle de Saint-Eustache habitent dans ces secteurs. \n\nMise à jour : janvier 2024","On observe peu de changements significatifs dans la répartition des secteurs où les conditions sont les plus défavorables sociale (quintile 5 – en orangé) de 2021 par rapport à celles de 2016. Un secteur de Mirabel est passé du quintile 4 au quintile 5. Quelques secteurs sont passés du quintile 5 à un quintile plus favorable à Sainte-Marthe-sur-le-Lac et Deux-Montagnes.\n\nÀ savoir - Les variations entre 2016 et 2021 ont plusieurs causes possibles. Elles peuvent être dues à des changements 1) dans la population des secteurs auxquels on réfère, 2) dans la population de l’ensemble du territoire auquel les secteurs sont comparés, ou encore 3) dans la compilation de l’indice, en raison, par exemple, des modifications du découpage des secteurs ou des données manquantes.\n\nMise à jour : février 2024","J3:O40","A19:K34","Répartition de la population (N, %) par niveau de défavorisation sociale 2021 de la région des Laurentides - secteur RLS de Deux-Montagnes - Mirabel-Sud","Source : INSPQ et BIESP, 2023. Statistique Canada, Recensement 2021.","A15","16.5","Population des secteurs ayant les conditions sociales les plus défavorables - secteur RLS de Deux-Montagnes - Mirabel-Sud, 2021","Panorama de la défavorisation dans les Laurentides 2021, produit par l’équipe Surveillance, recherche et évaluation, Direction de santé publique des Laurentides, Centre intégré de santé et de services sociaux des Laurentides, 2024","A16","La population sans indice réside dans des secteurs où l’information pour le calcul de l’indice est indisponible à cause des ménages collectifs (centres d’hébergement, pénitenciers) ou du taux de non-réponse trop élevé.","A17","https://www.santelaurentides.gouv.qc.ca/sante-publique/donnees-sur-la-population/panorama-de-la-defavorisation/","A1:O15","A1:O13","Répartition de la population (N, %) par niveau de défavorisation sociale 2021 de la région des Laurentides - secteur RLS de Deux-Montagnes - Mirabel-Sud","Dans le RLS Deux-Montagnes-Mirabel-Sud, les secteurs ayant les conditions sociales parmi les plus défavorables (quintile 5) se répartissent dans les municipalités de Deux-Montagnes, Mirabel, Pointe-Calumet et Saint-Eustache. Environ le tiers de la population de la municipalité de Deux-Montagnes et le quart de celle de Saint-Eustache habitent dans ces secteurs. \n\nMise à jour : janvier 2024"]
[1516,"1516Matérielle et socialeRégional","Régional","Matérielle et sociale","A777:O784","A1:N4","J777:K784","A12:B15","A777:A784","RLS RDN","RLS_RDN_2016_Comb","A6","B2","B6","B2","A6","Dans le RLS de la Rivière-du-Nord-Mirabel-Nord, les secteurs ayant les conditions les plus défavorables à la fois au plan matériel et social (profil 5 – en violet) dans toutes les municipalités du territoire SAUF à Saint-Colomban. Plus du tiers de la population de Saint-Jérôme habite ces secteurs.\n\nLes secteurs où les conditions sont parmi les plus défavorables seulement au plan social (profil 3 – en bleu) se retrouvent à Mirabel, Saint-Jérôme, Prévost et Saint-Hippolyte. \n\nOn retrouve des secteurs qui présentent les conditions parmi les plus défavorables uniquement au plan matériel (profil 4 – en orangé) dans toutes les municipalités du territoire. Les trois-quarts de la population de Sainte-Sophie résident dans ces secteurs.\n\nMise à jour : janvier 2024","Près d’un cinquième de la population du RLS de La Rivière-du-Nord-Mirabel-Nord habitent des secteurs ayant les conditions les plus défavorables à la fois au plan matériel et social (profil 5). Ces secteurs sont localisés dans toutes les municipalités du RLS SAUF Saint-Colomban. Plus du tiers de la population de Saint-Jérôme habite ces secteurs.\n\nLe quart de la population du RLS de La Rivière-du-Nord-Mirabel-Nord habitent des secteurs où les conditions sont les plus défavorables seulement au plan social (profil 3). Ces derniers se retrouvent à Mirabel, Prévost, Saint-Hippolyte et à Saint-Jérôme. Le tiers de la population de Prévost et près du quart de celle de la partie nord de Mirabel résident dans ces secteurs.\n\nPlus d’un cinquième de la population du RLS de La Rivière-du-Nord-Mirabel-Nord habitent des secteurs où les conditions sont les plus défavorables uniquement au plan matériel (profil 4). On retrouve ces secteurs dans toutes les municipalités du territoire. Les trois-quarts de la population de Sainte-Sophie, ainsi que plus du tiers de celle de Saint-Colomban et de Saint-Hippolyte résident dans ces secteurs.\n\nMise à jour : janvier 2024","Lorsqu’on se concentre sur l’évolution des secteurs du profil 5 (violet), soit ceux ayant les conditions matérielles et sociales parmi les plus défavorables, on remarque que plusieurs se sont ajoutés en 2021 par rapport à 2016 au profil 5 en 2021. Ils se trouvent dans Saint-Colomban, Sainte-Sophie et Mirabel. À l’inverse, d’autres secteurs de Mirabel et des secteurs de Saint-Jérôme, sont passés d’un quintile 5 en 2016 à des quintiles plus favorisés en 2021. On observe d’autres variations mineures dans Mirabel.\n\nÀ savoir - Les variations entre 2016 et 2021 ont plusieurs causes possibles. Elles peuvent être dues à des changements 1) dans la population des secteurs auxquels on réfère, 2) dans la population de l’ensemble du territoire auquel les secteurs sont comparés, ou encore 3) dans la compilation de l’indice, en raison, par exemple, des modifications du découpage des secteurs ou des données manquantes. \n\nMise à jour : février 2024","J3:O40","A17:K32","Répartition de la population selon les profils de défavorisation matérielle et sociale combinée 2021 de la région des Laurentides - secteur RLS de la Rivière-du-Nord - Mirabel-Nord","Source : INSPQ et BIESP, 2023. Statistique Canada, Recensement 2021.","A14","49.5","Population des secteurs ayant les conditions matérielles et sociales les plus défavorables - secteur de la RLS Rivière-du-Nord - Mirabel-Nord, 2021","Panorama de la défavorisation dans les Laurentides 2021, produit par l’équipe Surveillance, recherche et évaluation, Direction de santé publique des Laurentides, Centre intégré de santé et de services sociaux des Laurentides, 2024","A15","La population sans indice réside dans des secteurs où l’information pour le calcul de l’indice est indisponible à cause des ménages collectifs (centres d’hébergement, pénitenciers) ou du taux de non-réponse trop élevé.","A16","https://www.santelaurentides.gouv.qc.ca/sante-publique/donnees-sur-la-population/panorama-de-la-defavorisation/","A1:O14","A1:O13","Répartition de la population selon les profils de défavorisation matérielle et sociale combinée 2021 de la région des Laurentides - secteur RLS de la Rivière-du-Nord - Mirabel-Nord","Près d’un cinquième de la population du RLS de La Rivière-du-Nord-Mirabel-Nord habitent des secteurs ayant les conditions les plus défavorables à la fois au plan matériel et social (profil 5). Ces secteurs sont localisés dans toutes les municipalités du RLS SAUF Saint-Colomban. Plus du tiers de la population de Saint-Jérôme habite ces secteurs.\n\n Mise à jour : janvier 2024"]
[1516,"1516MatérielleRégional","Régional","Matérielle","A801:O808","A7:N9","J801:K808","A18:B20","A801:A808","RLS RDN","RLS_RDN_2016_Mat","A5","B2","B5","B2","A5","Dans le RLS de la Rivière-du-Nord-Mirabel-Nord, les secteurs ayant les conditions matérielles parmi les plus défavorables (quintile 5 – en orangé) se situent à Mirabel, Saint-Colomban, Saint-Jérôme et Sainte-Sophie. Le tiers de la population de Sainte-Sophie et plus du quart de celle de Saint-Jérôme habitent ces secteurs. \n\nMise à jour : janvier 2024","Près d’un cinquième de la population du RLS de La Rivière-du-Nord-Mirabel-Nord habitent des secteurs ayant les conditions matérielles les plus défavorables (quintile 5). Ces secteurs se trouvent à Mirabel, Saint-Colomban, Sainte-Sophie et Saint-Jérôme. Le tiers de la population de Sainte-Sophie et plus du quart de celle de Saint-Jérôme habitent ces secteurs. \n\nMise à jour : janvier 2024","Lorsqu’on se concentre sur l’évolution des secteurs se retrouvant dans des conditions parmi les plus défavorables matériellement (quintile 5 – en orangé), on constate que certains secteurs sont passés d’un quintile 3 ou 4 en 2016 au quintile 5 en 2021. Ils se trouvent dans Saint-Colomban, Saint-Jérôme, Sainte-Sophie et Mirabel. À l’inverse, d’autres secteurs de Saint-Jérôme sont passés d’un quintile 5 en 2016 à des quintiles plus favorisés en 2021.\n\nÀ savoir - Les variations entre 2016 et 2021 ont plusieurs causes possibles. Elles peuvent être dues à des changements 1) dans la population des secteurs auxquels on réfère, 2) dans la population de l’ensemble du territoire auquel les secteurs sont comparés, ou encore 3) dans la compilation de l’indice, en raison, par exemple, des modifications du découpage des secteurs ou des données manquantes.\n\nMise à jour : février 2024","J3:O40","A16:K31","Répartition de la population (N, %) par niveau de défavorisation matérielle 2021 de la région des Laurentides - secteur RLS de la Rivière-du-Nord - Mirabel-Nord","Source : INSPQ et BIESP, 2023. Statistique Canada, Recensement 2021.","A13","16.5","Population des secteurs ayant les conditions matérielles les plus défavorables - secteur de la RLS Rivière-du-Nord - Mirabel-Nord, 2021","Panorama de la défavorisation dans les Laurentides 2021, produit par l’équipe Surveillance, recherche et évaluation, Direction de santé publique des Laurentides, Centre intégré de santé et de services sociaux des Laurentides, 2024","A14","La population sans indice réside dans des secteurs où l’information pour le calcul de l’indice est indisponible à cause des ménages collectifs (centres d’hébergement, pénitenciers) ou du taux de non-réponse trop élevé.","A15","https://www.santelaurentides.gouv.qc.ca/sante-publique/donnees-sur-la-population/panorama-de-la-defavorisation/","A1:O13","A1:O12","Répartition de la population (N, %) par niveau de défavorisation matérielle 2021 de la région des Laurentides - secteur RLS de la Rivière-du-Nord - Mirabel-Nord","Près d’un cinquième de la population du RLS de La Rivière-du-Nord-Mirabel-Nord habitent des secteurs ayant les conditions matérielles les plus défavorables (quintile 5). Ces secteurs se trouvent à Mirabel, Saint-Colomban, Sainte-Sophie et Saint-Jérôme. Le tiers de la population de Sainte-Sophie et plus du quart de celle de Saint-Jérôme habitent ces secteurs. \n\nMise à jour : janvier 2024"]
[1516,"1516SocialeRégional","Régional","Sociale","A825:O832","A7:N9","J825:K832","A18:B20","A825:A832","RLS RDN","RLS_RDN_2016_Soc","A5","B2","B5","B2","A5","Dans le RLS de la Rivière-du-Nord-Mirabel-Nord, les secteurs ayant les conditions sociales parmi les plus défavorables (quintile 5 – en orangé) sont localisés à Mirabel, Prévost et principalement à Saint-Jérôme. Plus de 40 % des Jérômiens habitent ces secteurs. \n\nMise à jour : janvier 2024","Près du quart de la population du RLS de La Rivière-du-Nord-Mirabel-Nord habitent des secteurs ayant les conditions sociales les plus défavorables (quintile 5). Ces secteurs se trouvent à Mirabel, Prévost et à Saint-Jérôme. Plus de 40 % des Jérômiens habitent ces secteurs. \n\nMise à jour : janvier 2024","On n’observe pas de changements significatifs dans la répartition des secteurs où les conditions sont les plus défavorables sociale (quintile 5 – en orangé) de 2021 par rapport à celles de 2016.\n\nÀ savoir - Les variations entre 2016 et 2021 ont plusieurs causes possibles. Elles peuvent être dues à des changements 1) dans la population des secteurs auxquels on réfère, 2) dans la population de l’ensemble du territoire auquel les secteurs sont comparés, ou encore 3) dans la compilation de l’indice, en raison, par exemple, des modifications du découpage des secteurs ou des données manquantes.\n\nMise à jour : février 2024","J3:O40","A16:K31","Répartition de la population (N, %) par niveau de défavorisation sociale 2021 de la région des Laurentides - secteur RLS de la Rivière-du-Nord - Mirabel-Nord","Source : INSPQ et BIESP, 2023. Statistique Canada, Recensement 2021.","A13","16.5","Population des secteurs ayant les conditions sociales les plus défavorables - secteur de la RLS Rivière-du-Nord - Mirabel-Nord, 2021","Panorama de la défavorisation dans les Laurentides 2021, produit par l’équipe Surveillance, recherche et évaluation, Direction de santé publique des Laurentides, Centre intégré de santé et de services sociaux des Laurentides, 2024","A14","La population sans indice réside dans des secteurs où l’information pour le calcul de l’indice est indisponible à cause des ménages collectifs (centres d’hébergement, pénitenciers) ou du taux de non-réponse trop élevé.","A15","https://www.santelaurentides.gouv.qc.ca/sante-publique/donnees-sur-la-population/panorama-de-la-defavorisation/","A1:O13","A1:O12","Répartition de la population (N, %) par niveau de défavorisation sociale 2021 de la région des Laurentides - secteur RLS de la Rivière-du-Nord - Mirabel-Nord","Près du quart de la population du RLS de La Rivière-du-Nord-Mirabel-Nord habitent des secteurs ayant les conditions sociales les plus défavorables (quintile 5). Ces secteurs se trouvent à Mirabel, Prévost et à Saint-Jérôme. Plus de 40 % des Jérômiens habitent ces secteurs. \n\nMise à jour : janvier 2024 "]
[15991,{"$f":"A83&D83&C83","v":"15991Matérielle et socialeRégional"},"Régional","Matérielle et sociale","A847:O854","A1:N4","J847:K854","A12:B15","A847:A854","Région RLS","RLS Comb Régional Q5","A6","B2","B6","B2","A6","Analyse non disponible","Une diversité de situations\nParmi les principales différences observées dans la répartition de la population des RLS par profil de défavorisation, on remarque que les RLS Argenteuil, Les Laurentides et Rivière-du-Nord-Mirabel-Nord ont une part plus élevée que la moyenne régionale de leurs populations qui résident dans des secteurs plus défavorisés à la fois matériellement et socialement (profil 5).\n\nLes RLS Antoine-Labelle et Argenteuil se démarquent à  deux égards : \n• par une grande part de leurs populations qui habitent des secteurs parmi les plus défavorisés matériellement seulement (profil 4);\n• à l’inverse, par une très petite proportion de personnes qui résident dans des secteurs défavorisés socialement seulement (profil 3). \n\nComparé à la région, le RLS Les Laurentides a une proportion plus élevée de sa populations habitant des secteurs de profils 4 (secteurs plus défavorisés matériellement seulement).\n\nPrès de la moitié de la population du RLS Pays-d’en-Haut se trouve dans les secteurs ayant des conditions sociales uniquement parmi les plus défavorables de la région (profil 3). Le RLS Thérèse-De Blainville et Rivière-du-Nord-Mirabel-Nord ont aussi des proportions de leurs populations supérieures à la région vivant dans des secteurs de profil 3.\n\nParmi tous les territoires, Les Pays-d’en-Haut et Deux-Montagnes-Mirabel-Sud comportent les plus grandes proportions de leurs populations vivant dans des secteurs ayant des conditions moyennes matériellement et socialement (profil 2).\n\nLes RLS Thérèse-De Blainville et Deux-Montagnes-Mirabel-Sud sont ceux ayant la plus grande part de résidents de secteurs ayant des conditions matériellement et socialement plus favorables (profil 1).\n\nLe nombre de personnes habitant les secteurs les plus défavorisés dépend du niveau de défavorisation et de la taille de la population du RLS\nOn dénombre environ 105 100 personnes qui résident dans les secteurs aux conditions les plus défavorables matériellement et socialement (profil 5) de la région des Laurentides.\n\nDans le RLS de la Rivière-du-Nord-Mirabel-Nord, on estime que 35 800 personnes habitent des secteurs du profil 5.\n\nMême si le RLS Thérèse-De Blainville est considéré comme un territoire plus favorisé, on y compte 17 500 personnes qui résident dans des secteurs parmi les plus défavorisés matériellement et socialement (profil 5). \n\nMise à jour : février 2024","Analyse 2016-2021 non disponible","J3:O40","A18:K53","Répartition de la population selon les profils de défavorisation matérielle et sociale combinée 2021 de la région des Laurentides selon ses RLS","Source : INSPQ et BIESP, 2023. Statistique Canada, Recensement 2021.","A14","49.5","Proportion de la population ayant les conditions matérielles et sociales les plus défavorables de la région des Laurentides selon ses RLS, 2021","Panorama de la défavorisation dans les Laurentides 2021, produit par l’équipe Surveillance, recherche et évaluation, Direction de santé publique des Laurentides, Centre intégré de santé et de services sociaux des Laurentides, 2024","A15","La population sans indice réside dans des secteurs où l’information pour le calcul de l’indice est indisponible à cause des ménages collectifs (centres d’hébergement, pénitenciers) ou du taux de non-réponse trop élevé.","A16","https://www.santelaurentides.gouv.qc.ca/sante-publique/donnees-sur-la-population/panorama-de-la-defavorisation/","A1:O16","A1:O15","Proportion de la population ayant les conditions matérielles et sociales les plus défavorables de la région des Laurentides selon ses RLS, 2021","Analyse non disponible"]
[15991,"15991MatérielleRégional","Régional","Matérielle","A861:O868","A7:N9","J861:K868","A18:B20","A861:A868","Région RLS","RLS Mat Régional Q5","A5","B2","B5","B2","A5","Analyse non disponible","La défavorisation matérielle en proportion de la population\nC’est dans les RLS Antoine-Labelle et Argenteuil que la défavorisation matérielle est la plus forte : plus des trois-quarts de la population vit dans des secteurs parmi les plus défavorisés de la région (quintiles 4 et 5).\n\nPlus de la moitié de la population du RLS Les Laurentides vit dans des secteurs parmi les plus défavorisés matériellement de la région (quintiles 4 et 5). \n\nParmi tous les RLS de la région, Pays-d’en-Haut et Thérèse-De Blainville sont ceux qui présentent les proportions les plus importantes de leurs populations vivant dans des secteurs ayant des conditions matérielles plus favorables (quintiles 1 et 2).\n\nLa défavorisation matérielle en nombre de personnes\nLe RLS Rivière-du-Nord-Mirabel-Nord est celui où on retrouve le plus grand nombre de résidents vivant dans des secteurs du quintile 5, soit 32 200 personnes. Les RLS Antoine-Labelle et Argenteuil, bien que mois populeux, regroupent chacune plus de 20 000 personnes vivant dans des secteurs du quintile 5.\n\nMême s’ils sont considérés comme des territoires plutôt favorisés, les RLS de Thérèse-De Blainville et de Deux-Montagnes-Mirabel-Sud comptent chacun plus de 29 000 personnes vivant dans les secteurs de quintiles 4 ou 5, soit parmi les plus défavorisés matériellement de la région.\n\nMise à jour : février 2024","Analyse 2016-2021 non disponible","J3:O40","A17:K52","Répartition de la population (N, %) par quintile de défavorisation matérielle 2021 de la région des Laurentides selon ses RLS","Source : INSPQ et BIESP, 2023. Statistique Canada, Recensement 2021.","A13","16.5","Proportion de la population ayant les conditions matérielles les plus défavorables de la région des Laurentides selon ses RLS, 2021","Panorama de la défavorisation dans les Laurentides 2021, produit par l’équipe Surveillance, recherche et évaluation, Direction de santé publique des Laurentides, Centre intégré de santé et de services sociaux des Laurentides, 2024","A14","La population sans indice réside dans des secteurs où l’information pour le calcul de l’indice est indisponible à cause des ménages collectifs (centres d’hébergement, pénitenciers) ou du taux de non-réponse trop élevé.","A15","https://www.santelaurentides.gouv.qc.ca/sante-publique/donnees-sur-la-population/panorama-de-la-defavorisation/","A1:O15","A1:O14","Proportion de la population ayant les conditions matérielles les plus défavorables de la région des Laurentides selon ses RLS, 2021","Analyse non disponible"]
[15991,"15991SocialeRégional","Régional","Sociale","A875:O882","A7:N9","J875:K882","A18:B20","A875:A882","Région RLS","RLS Soc Régional Q5","A5","B2","B5","B2","A5","Analyse non disponible","La défavorisation sociale en proportion de la population\nPlus de la moitié de la population du RLS Pays-d’en-Haut habite des secteurs ayant des conditions sociales parmi les moins favorables (quintiles 4 ou 5) de la région des Laurentides.\n\nLes RLS Les Laurentides, Rivière-du-Nord-Mirabel-Nord, Argenteuil et Thérèse-De Blainville comptent aussi des proportions nettement plus élevées que la moyenne régionale de leurs populations vivant dans des secteurs les plus défavorisés socialement (quintile 5). \n\nPlus de la moitié de la population du Antoine-Labelle réside des secteurs parmi les plus favorisés de la région (quintiles 1 et 2).\n\nLa défavorisation sociale en nombre de personnes\nEn nombre, les RLS qui comptent le plus de résidents de secteurs ayant des conditions sociales parmi les plus défavorables de la région (quintile 5) sont Rivière-du-Nord-Mirabel-Nord, avec 40 200 personnes, et Thérèse-De Blainville, avec 35 000 personnes..\n\nMalgré une situation globalement favorable, le RLS Deux-Montagnes-Mirabel-Sud compte tout de même près de 18 200 personnes qui habitent dans des secteurs dont les conditions sociales sont parmi les plus défavorables de la région (quintile 5).\n\nMise à jour : février 2024","Analyse 2016-2021 non disponible","J3:O40","A17:K52","Répartition de la population (N, %) par quintile de défavorisation sociale 2021 de la région des Laurentides selon ses RLS","Source : INSPQ et BIESP, 2023. Statistique Canada, Recensement 2021.","A13","16.5","Proportion de la population ayant les conditions sociales les plus défavorables de la région des Laurentides selon ses RLS, 2021","Panorama de la défavorisation dans les Laurentides 2021, produit par l’équipe Surveillance, recherche et évaluation, Direction de santé publique des Laurentides, Centre intégré de santé et de services sociaux des Laurentides, 2024","A14","La population sans indice réside dans des secteurs où l’information pour le calcul de l’indice est indisponible à cause des ménages collectifs (centres d’hébergement, pénitenciers) ou du taux de non-réponse trop élevé.","A15","https://www.santelaurentides.gouv.qc.ca/sante-publique/donnees-sur-la-population/panorama-de-la-defavorisation/","A1:O15","A1:O14","Proportion de la population ayant les conditions sociales les plus défavorables de la région des Laurentides selon ses RLS, 2021","Analyse non disponible"]
[15992,{"$f":"A86&D86&C86","v":"15992Matérielle et socialeRégional"},"Régional","Matérielle et sociale","A893:O901","A1:N4","J893:K901","A12:B15","A893:A901","Région MRC","MRC Com Régional Q5","A6","B2","B6","B2","A6","Analyse non disponible","Une diversité de situations\nParmi les principales différences observées dans la répartition de la population des MRC par profil de défavorisation, on remarque que les MRC Argenteuil, Les Laurentides et Rivière-du-Nord ont une part plus élevée que la moyenne régionale de leurs populations qui résident dans des secteurs plus défavorisés à la fois matériellement et socialement (profil 5).\n\nLes MRC Antoine-Labelle et Argenteuil se démarquent à  deux égards : \n• par une large part de leurs populations qui habitent des secteurs parmi les plus défavorisés matériellement seulement (profil 4);\n• à l’inverse, par une très petite proportion de personnes qui résident dans des secteurs défavorisés socialement seulement (profil 3). \n\nComparée à la région, les MRC Les Laurentides et Rivière-du-Nord ont des proportions plus élevées de leurs populations habitant des secteurs de profils 4 (secteurs plus défavorisés matériellement seulement).\n\nPrès de la moitié de la population de la MRC des Pays-d’en-Haut se retrouve dans les secteurs ayant des conditions sociales uniquement parmi les plus défavorables de la région (profil 3). La MRC Thérèse-De Blainville et Mirabel ont aussi des proportions de leurs populations supérieures à la région vivant dans des secteurs de profil 3.\n\nParmi tous les territoires, Mirabel, Les Pays-d’en-Haut et Deux-Montagnes comportent les plus grandes proportions de leurs populations vivant dans des secteurs ayant des conditions moyennes matériellement et socialement (profil 2).\n\nLes MRC Thérèse-De Blainville et Deux-Montagnes sont ceux ayant la plus grande part de résidents de secteurs ayant des conditions matériellement et socialement plus favorables (profil 1).\n\nLe nombre de personnes habitant les secteurs les plus défavorisés dépend du niveau de défavorisation et de la taille de la population de la MRC\nOn dénombre environ 105 100 personnes qui résident dans les secteurs aux conditions plus défavorables matériellement et socialement (profil 5) de la région des Laurentides.\n\nDans la MRC de la Rivière-du-Nord, on estime que 29 900 personnes habitent des secteurs du profil 5.\n\nMême si la MRC Thérèse-De Blainville est considérée comme un territoire plus favorisé, on y compte 17 500 personnes qui résident dans des secteurs parmi les plus défavorisés matériellement et socialement (profil 5). \n\nMise à jour : février 2024","Analyse 2016-2021 non disponible","J3:O40","A19:K54","Répartition de la population selon les profils de défavorisation matérielle et sociale combinée 2021 de la région des Laurentides selon ses MRC","Source : INSPQ et BIESP, 2023. Statistique Canada, Recensement 2021.","A15","49.5","Proportion de la population ayant les conditions matérielles et sociales les plus défavorables de la région des Laurentides selon ses MRC, 2021","Panorama de la défavorisation dans les Laurentides 2021, produit par l’équipe Surveillance, recherche et évaluation, Direction de santé publique des Laurentides, Centre intégré de santé et de services sociaux des Laurentides, 2024","A16","La population sans indice réside dans des secteurs où l’information pour le calcul de l’indice est indisponible à cause des ménages collectifs (centres d’hébergement, pénitenciers) ou du taux de non-réponse trop élevé.","A17","https://www.santelaurentides.gouv.qc.ca/sante-publique/donnees-sur-la-population/panorama-de-la-defavorisation/","A1:O17","A1:O16","Proportion de la population ayant les conditions matérielles et sociales les plus défavorables de la région des Laurentides selon ses RLS, 2021","Analyse non disponible"]
[15992,"15992MatérielleRégional","Régional","Matérielle","A908:O916","A7:N9","J908:K916","A18:B20","A908:A916","Région MRC","MRC Mat Régional Q5","A5","B2","B5","B2","A5","Analyse non disponible","La défavorisation matérielle en proportion de la population\nC’est dans les MRC Antoine-Labelle et Argenteuil que la défavorisation matérielle est la plus forte : plus des trois-quarts de la population vit dans des secteurs parmi les plus défavorisés de la région (quintiles 4 et 5).\n\nPlus de la moitié de la population de la MRC Les Laurentides vit dans des secteurs parmi les plus défavorisés matériellement de la région (quintiles 4 et 5). \n\nParmi toutes les MRC de la région, Pays-d’en-Haut, Thérèse-De Blainville et Mirabel sont celles qui présentent les proportions les plus importantes de leurs populations vivant dans des secteurs ayant des conditions matérielles plus favorables (quintiles 1 et 2).\n\nLa défavorisation matérielle en nombre de personnes\nLa MRC Rivière-du-Nord est celle où on retrouve le plus grand nombre de résidents vivant dans des secteurs du quintile 5, soit 28 900 personnes. Les MRC Antoine-Labelle et Argenteuil, bien que mois populeuses, regroupent chacune plus de 20 000 personnes vivant dans des secteurs du quintile 5.\n\nMême si elles est considérée comme plutôt favorisée, la MRC de Thérèse-De Blainville compte environ 14 200 personnes vivant dans les secteurs parmi les plus défavorisés matériellement de la région (quintile 5).\n\nMise à jour : février 2024","Analyse 2016-2021 non disponible","J3:O40","A18:K53","Répartition de la population (N, %) par quintile de défavorisation matérielle 2021 de la région des Laurentides selon ses MRC","Source : INSPQ et BIESP, 2023. Statistique Canada, Recensement 2021.","A14","16.5","Proportion de la population ayant les conditions matérielles les plus défavorables de la région des Laurentides selon ses MRC, 2021","Panorama de la défavorisation dans les Laurentides 2021, produit par l’équipe Surveillance, recherche et évaluation, Direction de santé publique des Laurentides, Centre intégré de santé et de services sociaux des Laurentides, 2024","A15","La population sans indice réside dans des secteurs où l’information pour le calcul de l’indice est indisponible à cause des ménages collectifs (centres d’hébergement, pénitenciers) ou du taux de non-réponse trop élevé.","A16","https://www.santelaurentides.gouv.qc.ca/sante-publique/donnees-sur-la-population/panorama-de-la-defavorisation/","A1:O16","A1:O15","Proportion de la population ayant les conditions matérielles les plus défavorables de la région des Laurentides selon ses RLS, 2021","Analyse non disponible"]
[15992,"15992SocialeRégional","Régional","Sociale","A923:O931","A7:N9","J923:K931","A18:B20","A923:A931","Région MRC","MRC Soc Régional Q5","A5","B2","B5","B2","A5","Analyse non disponible","La défavorisation sociale en proportion de la population\nPlus de la moitié de la population de la MRC des Pays-d’en-Haut habite des secteurs ayant des conditions sociales parmi les moins favorables (quintiles 4 ou 5) de la région des Laurentides.\n\nLes MRC Les Laurentides, Rivière-du-Nord, Argenteuil et Thérèse-De Blainville comptent aussi des proportions nettement plus élevées que la moyenne régionale de leurs populations vivant dans des secteurs les plus défavorisés socialement (quintile 5). \n\nParmi tous les territoires de la région, Mirabel est celui qui présente la proportion la plus importante de sa population vivant dans des secteurs ayant des conditions sociales moyennes (quintile 3).\n\nPlus de la moitié de la population de la MRC Antoine-Labelle réside des secteurs parmi les plus favorisés de la région (quintiles 1 et 2).\n\nLa défavorisation sociale en nombre de personnes\nEn nombre, les MRC qui comptent le plus de résidents de secteurs ayant des conditions sociales parmi les plus défavorables de la région (quintile 5) sont Rivière-du-Nord, avec 35 400 personnes, et Thérèse-De Blainville, avec 35 000 personnes.\n\nMalgré une situation globalement favorable, la MRC Deux-Montagnes compte tout de même près de 17 400 personnes qui habitent dans des secteurs dont les conditions sociales sont parmi les plus défavorables de la région (quintile 5).\n\nMise à jour : février 2024","Analyse 2016-2021 non disponible","J3:O40","A18:K53","Répartition de la population (N, %) par quintile de défavorisation sociale 2021 de la région des Laurentides selon ses MRC","Source : INSPQ et BIESP, 2023. Statistique Canada, Recensement 2021.","A14","16.5","Proportion de la population ayant les conditions sociales les plus défavorables de la région des Laurentides selon ses MRC, 2021","Panorama de la défavorisation dans les Laurentides 2021, produit par l’équipe Surveillance, recherche et évaluation, Direction de santé publique des Laurentides, Centre intégré de santé et de services sociaux des Laurentides, 2024","A15","La population sans indice réside dans des secteurs où l’information pour le calcul de l’indice est indisponible à cause des ménages collectifs (centres d’hébergement, pénitenciers) ou du taux de non-réponse trop élevé.","A16","https://www.santelaurentides.gouv.qc.ca/sante-publique/donnees-sur-la-population/panorama-de-la-defavorisation/","A1:O16","A1:O15","Proportion de la population ayant les conditions sociales les plus défavorables de la région des Laurentides selon ses RLS, 2021","Analyse non disponible"]
[15993,{"$f":"A89&D89&C89","v":"15993Matérielle et socialeRégional"},"Régional","Matérielle et sociale","A947:O1032","A1:N4","J947:K1032","A12:B15","A947:A1032","Région RLS","Image_Liste_Mun","A6","B2","B6","B2","A6","Analyse non disponible","Analyse non disponible","Analyse 2016-2021 non disponible","J3:O40","A96:K104","Répartition de la population selon les profils de défavorisation matérielle et sociale combinée 2021 de la région des Laurentides selon ses RLS et ses municipalités","Source : INSPQ et BIESP, 2023. Statistique Canada, Recensement 2021.","A92","49.5","Proportion de la population ayant les conditions matérielles et sociales les plus défavorables de la région des Laurentides selon ses RLS, 2021","Panorama de la défavorisation dans les Laurentides 2021, produit par l’équipe Surveillance, recherche et évaluation, Direction de santé publique des Laurentides, Centre intégré de santé et de services sociaux des Laurentides, 2024","A93","La population sans indice réside dans des secteurs où l’information pour le calcul de l’indice est indisponible à cause des ménages collectifs (centres d’hébergement, pénitenciers) ou du taux de non-réponse trop élevé.","A94","https://www.santelaurentides.gouv.qc.ca/sante-publique/donnees-sur-la-population/panorama-de-la-defavorisation/","A1:O94","A1:O93"," ","Analyse non disponible"]
[15993,"15993MatérielleRégional","Régional","Matérielle","A1040:O1125","A7:N9","J1040:K1125","A18:B20","A1040:A1125","Région RLS","Image_Liste_Mun","A5","B2","B5","B2","A5","Analyse non disponible","Analyse non disponible","Analyse 2016-2021 non disponible","J3:O40","A95:K103","Répartition de la population (N, %) par quintile de défavorisation matérielle 2021 de la région des Laurentides selon ses RLS et ses municipalités","Source : INSPQ et BIESP, 2023. Statistique Canada, Recensement 2021.","A91","16.5","Proportion de la population ayant les conditions matérielles les plus défavorables de la région des Laurentides selon ses RLS, 2021","Panorama de la défavorisation dans les Laurentides 2021, produit par l’équipe Surveillance, recherche et évaluation, Direction de santé publique des Laurentides, Centre intégré de santé et de services sociaux des Laurentides, 2024","A92","La population sans indice réside dans des secteurs où l’information pour le calcul de l’indice est indisponible à cause des ménages collectifs (centres d’hébergement, pénitenciers) ou du taux de non-réponse trop élevé.","A93","https://www.santelaurentides.gouv.qc.ca/sante-publique/donnees-sur-la-population/panorama-de-la-defavorisation/","A1:O93","A1:O92"," ","Analyse non disponible"]
[15993,"15993SocialeRégional","Régional","Sociale","A1133:O1218","A7:N9","J1133:K1218","A18:B20","A1133:A1218","Région RLS","Image_Liste_Mun","A5","B2","B5","B2","A5","Analyse non disponible","Analyse non disponible","Analyse 2016-2021 non disponible","J3:O40","A95:K103","Répartition de la population (N, %) par quintile de défavorisation sociale 2021 de la région des Laurentides selon ses RLS et ses municipalités","Source : INSPQ et BIESP, 2023. Statistique Canada, Recensement 2021.","A91","16.5","Proportion de la population ayant les conditions sociales les plus défavorables de la région des Laurentides selon ses RLS, 2021","Panorama de la défavorisation dans les Laurentides 2021, produit par l’équipe Surveillance, recherche et évaluation, Direction de santé publique des Laurentides, Centre intégré de santé et de services sociaux des Laurentides, 2024","A92","La population sans indice réside dans des secteurs où l’information pour le calcul de l’indice est indisponible à cause des ménages collectifs (centres d’hébergement, pénitenciers) ou du taux de non-réponse trop élevé.","A93","https://www.santelaurentides.gouv.qc.ca/sante-publique/donnees-sur-la-population/panorama-de-la-defavorisation/","A1:O93","A1:O92"," ","Analyse non disponible"]

{"sheet":"Entete","index":6,"n_rows":30,"n_cols":14,"rows_kept":30,"cut":false,"hidden":false,"merged":[[27,0,27,1],[28,0,28,1],[22,0,22,1],[22,4,22,5],[22,6,23,6],[22,7,23,8],[22,9,23,9],[23,0,23,1],[23,2,23,3],[23,4,23,5],[2,11,2,12],[11,0,11,1],[17,0,17,1],[1,0,2,1],[1,2,2,3],[1,4,2,5],[1,6,2,7],[1,8,2,9],[12,0,13,1],[18,0,18,1],[6,10,7,10],[6,11,7,12],[6,13,7,13],[7,0,7,1],[7,2,7,3],[7,4,7,5],[7,6,7,7],[7,8,7,9],[6,0,6,1],[6,8,6,9],[0,0,0,1],[0,2,0,3],[0,4,0,5],[0,6,0,7],[0,8,0,9]]}
["Profil 1",null,"Profil 2",null,"Profil 3",null,"Profil 4",null,"Profil 5"]
["Conditions matériellement \nET socialement \nplus favorables",null,"Conditions moyennes matériellement\nEt socialement",null,"Conditions socialement\nplus défavorables\n(pas matériellement)",null,"Conditions matériellement\nplus défavorables\n(pas socialement)",null,"Conditions matériellement\nET socialement\nplus défavorables"]
[null,null,null,null,null,null,null,null,null,null,"Population\navec indice","Population\nsans indice",null,"Population\ntotale"]
["N","%","N","%","N","%","N","%","N","%","N","N","%","N"]
[]
[]
["Conditions\nplus favorables",null,null,null,null,null,null,null,"Conditions\nplus défavorables",null,"Population avec indice","Population\nsans indice",null,"Population totale"]
["Quintile 1",null,"Quintile 2",null,"Quintile 3",null,"Quintile 4",null,"Quintile 5"]
["N","%","N","%","N","%","N","%","N","%","N","N","%","N"]
[]
[]
["Profil 5"]
["Conditions matériellement\nET socialement\nplus défavorables"]
[]
["N","%"]
[]
[]
["Conditions\nplus défavorables"]
["Quintile 5"]
["N","%"]
[]
[]
["Conditions\nplus favorables",null,null,null,"Conditions\nplus défavorables",null,"Population avec indice","Population\nsans indice",null,"Population totale"]
["Quartile 1",null,"Quartiles 2-3",null,"Quartile 4"]
["N","%","N","%","N","%","N","N","%","N"]
[]
[]
["Conditions\nplus défavorables"]
["Quartile 4"]
["N","%"]

{"sheet":"Formulaire","index":7,"n_rows":16,"n_cols":19,"rows_kept":16,"cut":false,"hidden":false,"merged":[[21,1,21,3],[0,12,3,12]]}
[null,null,null,null,null,null,null,null,null,null,null,null,"Mode d'emploi en capsule vidéo",null,null,null,null,null,"Version : 25 mars 2024"]
[]
[]
[]
[]
["  Panorama de la défavorisation comprend une gamme d’outils sur l’indice de défavorisation dans la région des Laurentides et ses territoires. On retrouve des outils qui servent à :"]
["·         localiser les populations les plus défavorisées "]
["·         quantifier l’importance de la défavorisation dans des secteurs"]
["·         caractériser le profil de défavorisation des populations."]
[]
[]
[]
[]
[]
[null,"  Avez-vous l'intérêt sur la population…",null,null,null,"  Choisissez le territoire désiré…",null,null,null,null,"  Voulez-vous observer la défavorisation "]
[null,null,null,null,null,null,null,null,null,null,"  selon sa dimension…"]

{"sheet":"Choix","index":8,"n_rows":34,"n_cols":4,"rows_kept":34,"cut":false,"hidden":false,"merged":[]}
[null,720,"Matérielle et sociale","Local"]
[]
[]
[null,{"$f":"B1&C1&D1","v":"720Matérielle et socialeLocal"}]
["Plage totale",{"$f":"VLOOKUP(B$4,Correspondance!B$2:AZ$100,4,FALSE)","v":"A7:O14"}]
["Plage Q5",{"$f":"VLOOKUP(B$4,Correspondance!B$2:AZ$100,6,FALSE)","v":"J7:K14"}]
["Plage en tête totale",{"$f":"VLOOKUP(B$4,Correspondance!B$2:AZ$100,5,FALSE)","v":"A1:N4"}]
["Plage en tête Q5",{"$f":"VLOOKUP(B$4,Correspondance!B$2:AZ$100,7,FALSE)","v":"A12:B15"}]
["Plage Q5 Territoire",{"$f":"VLOOKUP(B$4,Correspondance!B$2:AZ$100,8,FALSE)","v":"A7:A14"}]
["Carte",{"$f":"VLOOKUP(B$4,Correspondance!B$2:AZ$100,10,FALSE)","v":"MRC_DM_2016_Comb"}]
["Endroit Copie Tableau",{"$f":"VLOOKUP(B$4,Correspondance!B$2:AZ$100,11,FALSE)","v":"A6"}]
["Endroit Copie en-tête",{"$f":"VLOOKUP(B$4,Correspondance!B$2:AZ$100,12,FALSE)","v":"B2"}]
["Endroit Copie Tableau Q5",{"$f":"VLOOKUP(B$4,Correspondance!B$2:AZ$100,13,FALSE)","v":"B6"}]
["Endroit Copie Q5 en-tête",{"$f":"VLOOKUP(B$4,Correspondance!B$2:AZ$100,14,FALSE)","v":"B2"}]
["Endroit Copie Tableau Territoire Q5",{"$f":"VLOOKUP(B$4,Correspondance!B$2:AZ$100,15,FALSE)","v":"A6"}]
["Texte carte",{"$f":"VLOOKUP(B$4,Correspondance!B$2:AZ$100,16,FALSE)","v":"Dans la MRC de Deux-Montagnes, les secteurs ayant des conditions parmi les plus défavorables de la MRC à la fois sur le plan matériel et social (profil 5 – en violet) sont localisés à Pointe-Calumet et à Saint-Eustache. À Pointe-Calumet, près du tiers de la population habite dans ces secteurs.\n\nLes secteurs où les conditions sont parmi les plus défavorables de la MRC seulement sur le plan social (profil 3 – en bleu) se trouvent à Pointe-Calumet, la municipalité de Deux-Montagnes, Saint-Eustache et à Sainte-Marthe-sur-le-Lac. Plus du tiers de la population de la municipalité de Deux-Montagnes habite dans ces secteurs.\n\nOn retrouve des secteurs qui présentent les conditions parmi les plus défavorables de la MRC seulement sur le plan matériel (profil 4 – en orangé) dans toutes les municipalités du territoire. Plus de la moitié de la population de Saint-Placide et de Pointe-Calumet réside dans ces secteurs.\n\nMise à jour : janvier 2024"}]
["Texte tableau",{"$f":"VLOOKUP(B$4,Correspondance!B$2:AZ$100,17,FALSE)","v":"Dans la MRC de Deux-Montagnes, les secteurs ayant des conditions parmi les plus défavorables de la MRC à la fois sur le plan matériel et social (profil 5) sont localisés à Pointe-Calumet et à Saint-Eustache. À Pointe-Calumet, près du tiers de la population habite dans ces secteurs.\n\nLes secteurs où les conditions sont parmi les plus défavorables de la MRC seulement sur le plan social (profil 3) se trouvent à Pointe-Calumet, la municipalité de Deux-Montagnes, Saint-Eustache et à Sainte-Marthe-sur-le-Lac. Plus du tiers de la population de la municipalité de Deux-Montagnes habite dans ces secteurs.\n\nOn retrouve des secteurs qui présentent les conditions parmi les plus défavorables de la MRC seulement sur le plan matériel (profil 4) dans toutes les municipalités du territoire. Plus de la moitié de la population de Saint-Placide et de Pointe-Calumet réside dans ces secteurs.\n\nMise à jour : janvier 2024"}]
["Texte 2011",{"$f":"VLOOKUP(B$4,Correspondance!B$2:AZ$100,18,FALSE)","v":0}]
["Endroit texte carte",{"$f":"VLOOKUP(B$4,Correspondance!B$2:AZ$100,19,FALSE)","v":"J3:O40"}]
["Endroit texte tableau",{"$f":"VLOOKUP(B$4,Correspondance!B$2:AZ$100,20,FALSE)","v":"A19:K34"}]
["Titre",{"$f":"VLOOKUP(B$4,Correspondance!B$2:AZ$100,21,FALSE)","v":"Répartition de la population selon les profils de défavorisation matérielle et sociale combinée 2021 de la MRC de Deux-Montagnes"}]
["Source",{"$f":"VLOOKUP(B$4,Correspondance!B$2:AZ$100,22,FALSE)","v":"Source : INSPQ et BIESP, 2023. Statistique Canada, Recensement 2021."}]
["Endroit Source",{"$f":"VLOOKUP(B$4,Correspondance!B$2:AZ$100,23,FALSE)","v":"A14"}]
["Hauteur Ligne 4",{"$f":"VLOOKUP(B$4,Correspondance!B$2:AZ$100,24,FALSE)","v":"49.5"}]
["Titre Q5",{"$f":"VLOOKUP(B$4,Correspondance!B$2:AZ$100,25,FALSE)","v":"Population des secteurs ayant les conditions matérielles et sociales les plus défavorables de la MRC de Deux-Montagnes, 2021"}]
["Source DSP",{"$f":"VLOOKUP(B$4,Correspondance!B$2:AZ$100,26,FALSE)","v":"Panorama de la défavorisation dans les Laurentides 2021, produit par l’équipe Surveillance, recherche et évaluation, Direction de santé publique des Laurentides, Centre intégré de santé et de services sociaux des Laurentides, 2024"}]
["Endroit Source DSP",{"$f":"VLOOKUP(B$4,Correspondance!B$2:AZ$100,27,FALSE)","v":"A15"}]
["Note Pop sans indice",{"$f":"VLOOKUP(B$4,Correspondance!B$2:AZ$100,28,FALSE)","v":"La population sans indice réside dans des secteurs où l’information pour le calcul de l’indice est indisponible à cause des ménages collectifs (centres d’hébergement, pénitenciers) ou du taux de non-réponse trop élevé."}]
["Endroit Note Pop sans indice",{"$f":"VLOOKUP(B$4,Correspondance!B$2:AZ$100,29,FALSE)","v":"A16"}]
["Lien vers Cartes 2011",{"$f":"VLOOKUP(B$4,Correspondance!B$2:AZ$100,30,FALSE)","v":"https://www.santelaurentides.gouv.qc.ca/sante-publique/donnees-sur-la-population/panorama-de-la-defavorisation/"}]
["Plage Tableau à copier",{"$f":"VLOOKUP(B$4,Correspondance!B$2:AZ$100,31,FALSE)","v":"A1:O16"}]
["Plage Tableau Q5 à copier",{"$f":"VLOOKUP(B$4,Correspondance!B$2:AZ$100,32,FALSE)","v":"A1:O14"}]
["Titre Carte",{"$f":"VLOOKUP(B$4,Correspondance!B$2:AZ$100,33,FALSE)","v":"Répartition de la population selon les profils de défavorisation matérielle et sociale combinée 2021 de la MRC de Deux-Montagnes"}]
["Texte tableauQ5",{"$f":"VLOOKUP(B$4,Correspondance!B$2:AZ$100,34,FALSE)","v":"Dans la MRC de Deux-Montagnes, les secteurs ayant des conditions parmi les plus défavorables de la MRC à la fois sur le plan matériel et social (profil 5) sont localisés à Pointe-Calumet et à Saint-Eustache. À Pointe-Calumet, près du tiers de la population habite ces secteurs.\n\nMise à jour : janvier 2024"}]