{"text_format":"1","workbook":"xlsx","n_sheets":9,"sheets":["Local","Région","Donnees_Local","Donnees_RLS_OLD","Liste","Correspondance","Entete","Formulaire","Choix"],"not_rendered":{"charts":0,"images":82,"macros":1,"external_links":0,"defined_names":1,"comments":0,"pivot_tables":0},"unopened":[],"bounds":{"document_bytes":16777216,"sheet_cells":100000,"rows_first":2000,"rows_last":500,"rows_between":2000,"halvings":0,"cell_chars":16384,"cell_head_chars":4096},"cells_cut":0,"cells_raw":0,"read":"whole","date_system":"1900"}

{"sheet":"Local","index":0,"n_rows":438,"n_cols":15,"rows_kept":438,"cut":false,"hidden":false,"merged":[[3,12,3,13],[416,12,417,13],[234,7,235,7],[326,1,326,2],[326,3,326,4],[326,5,326,6],[416,3,416,4],[416,5,416,6],[416,7,416,8],[416,1,416,2],[234,1,234,2],[234,5,234,6],[235,1,235,2],[235,3,235,4],[235,5,235,6],[416,14,417,14],[417,9,417,10],[234,8,235,9],[234,10,235,10],[415,0,415,14],[325,1,325,2],[325,5,325,6],[325,7,326,7],[325,8,326,9],[325,10,326,10],[417,1,417,2],[417,3,417,4],[417,5,417,6],[417,7,417,8],[416,11,417,11],[416,9,416,10],[1,9,1,10],[2,3,3,4],[2,5,3,6],[2,7,3,8],[1,1,1,2],[1,5,1,6],[2,1,3,2],[1,3,1,4],[1,7,1,8],[2,9,3,10]]}
["Répartition de la population selon les profils de défavorisation matérielle et sociale combinée 2021 de la région des Laurentides selon ses RLS et ses municipalités"]
[null,"Profil 1",null,"Profil 2",null,"Profil 3",null,"Profil 4",null,"Profil 5"]
[null,"Conditions matériellement \nET socialement \nplus favorables",null,"Conditions moyennes matériellement\nEt socialement",null,"Conditions socialement\nplus défavorables\n(pas matériellement)",null,"Conditions matériellement\nplus défavorables\n(pas socialement)",null,"Conditions matériellement\nET socialement\nplus défavorables"]
[null,null,null,null,null,null,null,null,null,null,null,"Population\navec indice","Population\nsans indice",null,"Population\ntotale"]
[null,"N","%","N","%","N","%","N","%","N","%","N","N","%","N"]
["Région des Laurentides",101800,0.16003772991667978,123800,0.19462348687313316,142900,0.22465021223078133,141000,0.22166326049363308,105100,0.16522559346014778,614600,21400,3.3642509039459208E-2,636100]
["RLS de Deux-Montagnes - Mirabel-Sud",22100,0.21121538711837839,31900,0.25159454344109122,25900,0.19311636116141739,26100,0.17386584715194786,13500,0.14874957729679816,119400,2600,2.1458283830367086E-2,122100]
["    Deux-Montagnes",3000,0.15662852358358917,4300,0.18816634105498189,7100,0.14496232207647222,1500,0.1574099916271281,1100,0.301255930784259,17000,900,5.1576890873569627E-2,17900]
["    Mirabel",0,0.17211061061914468,9000,0.16497552074085367,6400,0.30201861944788899,3700,0.32109279537083457,800,3.9802453821278082E-2,20000,0,0,20000]
["    Oka",1800,0.15650201612903225,1100,0.7036290322580645,500,0,500,0.13734879032258066,0,0,4000,0,2.5201612903225806E-3,4000]
["    Pointe-Calumet",0,8.6451202037892069E-2,0,0.43798758159528739,500,0,3300,0.25680624104441968,2500,0.2187549753224009,6300,0,0,6300]
["    Sainte-Marthe-sur-le-Lac",6500,6.2332676668182048E-2,7100,0.36409557003586401,2300,0.41046623225741269,3000,0.1631055210385412,900,0,19800,0,0,19800]
["    Saint-Eustache",9300,0.30795564979238449,8800,0.19188974291015107,7400,0.11787702093824542,9800,0.11120682039049386,8200,0.2338545807933563,43600,1700,3.721618517536885E-2,45300]
["    Saint-Joseph-du-Lac",1500,0.45370502062295548,700,0.22173232826056041,1600,0.10311477741430806,3200,0.22144787370217606,0,0,7000,0,0,7000]
["    Saint-Placide",0,0,700,0.58239910313901344,0,0.4176008968609865,1000,0,0,0,1800,0,0,1800]
["RLS Thérèse-De Blainville",51900,0.31697956389948179,21500,0.13156350836022293,41300,0.25229783905348585,21500,0.13164906619732081,17500,0.10717341351324924,153800,9900,6.033660897623936E-2,163600]
["    Blainville",22800,0.38109965061268158,11000,0.18398836490078402,13800,0.23057891305438072,4900,8.248215449940656E-2,2600,4.2695464651699294E-2,55100,4700,7.9155452281047825E-2,59800]
["    Boisbriand",6200,0.21845414723753001,2700,9.4708209693372888E-2,7600,0.26812208562950401,7300,0.25717111770524231,4600,0.16154443973435073,28300,0,0,28300]
["    Bois-des-Filion",500,5.0300226400236243E-2,1700,0.16438625849000885,5300,0.52170489221380056,1700,0.17147357023329068,600,5.856875676739836E-2,9800,300,3.3566295895265282E-2,10200]
["    Lorraine",8700,0.91286045043148822,400,4.3990738791833295E-2,400,4.3148810776678592E-2,0,0,0,0,9500,0,0,9500]
{"$rows_left_out":419}
{"sheet":"Région","index":1,"n_rows":0,"n_cols":0,"rows_kept":0,"cut":false,"hidden":false,"merged":[]}

{"sheet":"Donnees_Local","index":2,"n_rows":1218,"n_cols":29,"rows_kept":1218,"cut":false,"hidden":false,"merged":[[918,0,918,14],[919,1,919,2],[919,9,919,10],[919,11,920,11],[919,12,920,13],[919,14,920,14],[920,1,920,2],[920,3,920,4],[920,5,920,6],[920,7,920,8],[920,9,920,10],[903,0,903,14],[904,1,904,2],[904,9,904,10],[904,11,905,11],[904,12,905,13],[904,14,905,14],[905,1,905,2],[905,3,905,4],[905,5,905,6],[905,7,905,8],[905,9,905,10],[887,0,887,14],[888,1,888,2],[888,9,888,10],[888,11,890,11],[888,12,890,13],[888,14,890,14],[889,1,889,2],[889,3,889,4],[889,5,889,6],[889,7,889,8],[889,9,889,10],[890,1,890,2],[890,3,890,4],[890,5,890,6],[890,7,890,8],[890,9,890,10],[870,0,870,14],[871,1,871,2],[871,9,871,10],[871,11,872,11],[871,12,872,13],[871,14,872,14],[872,1,872,2],[872,3,872,4],[872,5,872,6],[872,7,872,8],[872,9,872,10],[856,0,856,14],[857,1,857,2],[857,9,857,10],[857,11,858,11],[857,12,858,13],[857,14,858,14],[858,1,858,2],[858,3,858,4],[858,5,858,6],[858,7,858,8],[858,9,858,10],[841,0,841,14],[842,1,842,2],[842,9,842,10],[842,11,844,11],[842,12,844,13],[842,14,844,14],[843,1,843,2],[843,3,843,4],[843,5,843,6],[843,7,843,8],[843,9,843,10],[844,1,844,2],[844,3,844,4],[844,5,844,6],[844,7,844,8],[844,9,844,10],[457,0,457,14],[458,1,458,2],[458,9,458,10],[458,11,459,11],[458,12,459,13],[458,14,459,14],[458,3,458,4],[458,5,458,6],[458,7,458,8],[459,1,459,2],[459,3,459,4],[459,5,459,6],[459,7,459,8],[459,9,459,10],[276,5,276,6],[276,7,277,7],[276,8,277,9],[276,10,277,10],[367,1,367,2],[367,5,367,6],[367,7,368,7],[367,8,368,9],[367,10,368,10],[368,1,368,2],[368,3,368,4],[368,5,368,6],[276,1,276,2],[277,1,277,2],[277,3,277,4],[277,5,277,6],[810,0,810,14],[811,1,811,2],[811,9,811,10],[811,11,812,11],[811,12,812,13],[811,14,812,14],[812,1,812,2],[812,3,812,4],[812,5,812,6],[812,7,812,8],[812,9,812,10],[764,9,764,10],[786,0,786,14],[787,1,787,2],[787,9,787,10],[787,11,788,11],[787,12,788,13],[787,14,788,14],[788,1,788,2],[788,3,788,4],[788,5,788,6],[788,7,788,8],[788,9,788,10],[93,0,93,14],[761,0,761,14],[762,1,762,2],[762,9,762,10],[762,11,764,11],[762,12,764,13],[762,14,764,14],[763,1,763,2],[763,3,763,4],[763,5,763,6],[763,7,763,8],[763,9,763,10],[764,1,764,2],[764,3,764,4],[764,5,764,6],[764,7,764,8],[94,14,95,14],[95,1,95,2],[95,3,95,4],[95,5,95,6],[95,7,95,8],[95,9,95,10],[94,1,94,2],[94,9,94,10],[1,0,1,14],[2,1,2,2],[2,9,2,10],[2,11,4,11],[2,12,4,13],[2,14,4,14],[3,1,3,2],[3,3,3,4],[3,5,3,6],[3,7,3,8],[3,9,3,10],[4,1,4,2],[4,3,4,4],[4,5,4,6],[4,7,4,8],[4,9,4,10],[94,11,95,11],[94,12,95,13],[184,0,184,14],[185,1,185,2],[185,9,185,10],[185,11,186,11],[185,12,186,13],[185,14,186,14],[186,1,186,2],[186,3,186,4],[186,5,186,6],[186,7,186,8],[186,9,186,10],[556,0,556,14],[557,1,557,2],[557,9,557,10],[557,11,558,11],[557,12,558,13],[557,14,558,14],[558,1,558,2],[558,3,558,4],[558,5,558,6],[558,7,558,8],[558,9,558,10],[655,0,655,14],[656,1,656,2],[656,9,656,10],[656,11,657,11],[656,12,657,13],[656,14,657,14],[657,1,657,2],[657,3,657,4],[657,5,657,6],[657,7,657,8],[657,9,657,10],[941,0,941,14],[942,1,942,2],[942,9,942,10],[942,11,944,11],[942,12,944,13],[942,14,944,14],[943,1,943,2],[943,3,943,4],[943,5,943,6],[943,7,943,8],[943,9,943,10],[944,1,944,2],[944,3,944,4],[944,5,944,6],[944,7,944,8],[944,9,944,10],[1035,0,1035,14],[1036,1,1036,2],[1036,9,1036,10],[1036,11,1037,11],[1036,12,1037,13],[1036,14,1037,14],[1037,1,1037,2],[1037,3,1037,4],[1037,5,1037,6],[1037,7,1037,8],[1037,9,1037,10],[1128,0,1128,14],[1129,1,1129,2],[1129,9,1129,10],[1129,11,1130,11],[1129,12,1130,13],[1129,14,1130,14],[1130,1,1130,2],[1130,3,1130,4],[1130,5,1130,6],[1130,7,1130,8],[1130,9,1130,10]]}
["ND"]
["Répartition de la population (N, %) par profil de défavorisation combinée 2021\nRégion des Laurentides (LOCAUX) 2021)"]
[null,"Conditions\nplus favorables",null,null,null,null,null,null,null,"Conditions\nplus défavorables",null,"Population\navec indice","Population\nsans indice",null,"Population\ntotale"]
[null,"Profil 1",null,"Profil 2",null,"Profil 3",null,"Profil 4",null,"Profil 5"]
[null,"matériellement \nET socialement \nplus favorables",null,"moyennes matériellement\nEt socialement",null,"socialement\nplus défavorables\n(pas matériellement)",null,"matériellement\nplus défavorables\n(pas socialement)",null,"matériellement\nET socialement\nplus défavorables"]
[null,"N","%","N","%","N","%","N","%","N","%","N   ","N","%","N"]
["MRC Deux-Montagnes",9300,9.094383255595187E-2,47400,0.46494924156312467,17500,0.17145180888174655,17500,0.17186336377533024,7700,7.5128365931093954E-2,99400,2600,2.5663387292752714E-2,102100,null,{"$f":"C7/100","v":9.0943832555951873E-4},null,{"$f":"E7/100","v":4.6494924156312463E-3},null,{"$f":"G7/100","v":1.7145180888174655E-3},null,{"$f":"I7/100","v":1.7186336377533024E-3},null,{"$f":"K7/100","v":7.5128365931093955E-4},null,null,{"$f":"N7/100","v":2.5663387292752712E-4}]
["    Deux-Montagnes",1800,9.8799888361708069E-2,7200,0.40307005302818866,7000,0.39263187273234723,1000,5.3921295004186437E-2,0,0,17000,900,5.1576890873569627E-2,17900,null,{"$f":"C8/100","v":9.8799888361708068E-4},null,{"$f":"E8/100","v":4.0307005302818869E-3},null,{"$f":"G8/100","v":3.9263187273234721E-3},null,{"$f":"I8/100","v":5.3921295004186437E-4},null,{"$f":"K8/100","v":0},null,null,{"$f":"N8/100","v":5.1576890873569628E-4}]
["    Oka",1200,0.30090725806451613,2300,0.56703629032258063,0,0,500,0.12953629032258066,0,0,4000,0,2.5201612903225806E-3,4000,null,3.0090725806451611E-3,null,5.6703629032258066E-3,null,0,null,1.2953629032258066E-3,null,0,null,null,2.5201612903225806E-5]
["    Pointe-Calumet",0,0,0,0,1000,0.16382741601655787,3300,0.52443878363317942,2000,0.31173380035026271,6300,0,0,6300,null,0,null,0,null,1.6382741601655786E-3,null,5.2443878363317943E-3,null,3.1173380035026273E-3,null,null,0]
["    Sainte-Marthe-sur-le-Lac",0,0,15800,0.79602970146991969,1900,9.6378239127140469E-2,2100,0.10759205940293985,0,0,19800,0,0,19800,null,0,null,7.9602970146991966E-3,null,9.6378239127140465E-4,null,1.0759205940293985E-3,null,0,null,null,0]
["    Saint-Eustache",5400,0.11818623553317431,16900,0.37373001148511359,7500,0.16622493153105394,8100,0.1785493418146479,5700,0.12609329446064141,43600,1700,3.721618517536885E-2,45300,null,1.1818623553317431E-3,null,3.7373001148511358E-3,null,1.6622493153105394E-3,null,1.785493418146479E-3,null,1.2609329446064141E-3,null,null,3.721618517536885E-4]
["    Saint-Joseph-du-Lac",1000,0.13739155169961598,4600,0.64756080216185463,0,0,1500,0.21504764613852939,0,0,7000,0,0,7000,null,1.3739155169961597E-3,null,6.4756080216185462E-3,null,0,null,2.1504764613852938E-3,null,0,null,null,0]
["    Saint-Placide",0,0,700,0.4176008968609865,0,0,1000,0.58239910313901344,0,0,1800,0,0,1800,null,0,null,4.1760089686098652E-3,null,0,null,5.8239910313901341E-3,null,0,null,null,0]
["MRC Thérèse-De Blainville",10100,6.1943874058863792E-2,78600,0.4800955803265865,26600,0.16244988755255696,26300,0.16086095629216779,12200,7.4313092793585611E-2,153800,9900,6.033660897623936E-2,163600,null,6.1943874058863787E-4,null,4.8009558032658653E-3,null,1.6244988755255696E-3,null,1.6086095629216778E-3,null,7.4313092793585613E-4,null,null,6.0336608976239363E-4]
["    Blainville",2800,4.6941607181664687E-2,39300,0.65681472441866295,5500,9.1910596967518673E-2,6500,0.10934652869489626,900,1.5831090456209566E-2,55100,4700,7.9155452281047825E-2,59800,null,4.6941607181664687E-4,null,6.5681472441866291E-3,null,9.1910596967518675E-4,null,1.0934652869489627E-3,null,1.5831090456209566E-4,null,null,7.9155452281047826E-4]
["    Boisbriand",600,2.006499929348594E-2,10500,0.37219160661297157,5400,0.18902783665394943,9500,0.33403984739296311,2400,8.4675710046629937E-2,28300,0,0,28300,null,2.006499929348594E-4,null,3.7219160661297159E-3,null,1.8902783665394943E-3,null,3.3403984739296313E-3,null,8.4675710046629941E-4,null,null,0]
["    Bois-des-Filion",0,0,2600,0.25976966236834337,4800,0.47662171473570231,2300,0.23004232700068905,0,0,9800,300,3.3566295895265282E-2,10200,null,0,null,2.5976966236834335E-3,null,4.766217147357023E-3,null,2.3004232700068903E-3,null,0,null,null,3.3566295895265283E-4]
["    Lorraine",3200,0.33350873500315731,6300,0.66649126499684275,0,0,0,0,0,0,9500,0,0,9500,null,3.3350873500315732E-3,null,6.6649126499684274E-3,null,0,null,0,null,0,null,null,0]
["    Rosemère",2700,0.19396735273243432,10200,0.72533711852377569,1100,8.0695528743789921E-2,0,0,0,0,14100,0,0,14100,null,1.9396735273243431E-3,null,7.2533711852377572E-3,null,8.0695528743789926E-4,null,0,null,0,null,null,0]
{"$rows_left_out":1199}
{"sheet":"Donnees_RLS_OLD","index":3,"n_rows":274,"n_cols":15,"rows_kept":274,"cut":false,"hidden":false,"merged":[[3,1,3,2],[3,9,3,10],[3,11,5,11],[3,12,5,13],[3,14,5,14],[4,1,4,2],[4,3,4,4],[4,5,4,6],[4,7,4,8],[2,0,2,14],[94,0,94,14],[95,1,95,2],[95,9,95,10],[95,11,96,11],[95,12,96,13],[95,14,96,14],[96,1,96,2],[96,3,96,4],[96,5,96,6],[4,9,4,10],[5,1,5,2],[5,3,5,4],[5,5,5,6],[5,7,5,8],[5,9,5,10],[187,5,187,6],[187,7,187,8],[187,9,187,10],[96,7,96,8],[96,9,96,10],[185,0,185,14],[186,1,186,2],[186,9,186,10],[186,11,187,11],[186,12,187,13],[186,14,187,14],[187,1,187,2],[187,3,187,4]]}
["Défavorisation combinée 2016 RLS"]
[]
["Répartition de la population (N, %) par profil de défavorisation combinée 2016\nRégion des Laurentides (variation régionale 2016)"]
[null,"Conditions\nplus favorables",null,null,null,null,null,null,null,"Conditions\nplus défavorables",null,"Population\navec indice","Population\nsans indice",null,"Population\ntotale"]
[null,"Profil 1",null,"Profil 2",null,"Profil 3",null,"Profil 4",null,"Profil 5"]
[null,"matériellement \nET socialement \nplus favorables",null,"moyennes matériellement\nEt socialement",null,"socialement\nplus défavorables\n(pas matériellement)",null,"matériellement\nplus défavorables\n(pas socialement)",null,"matériellement\nET socialement\nplus défavorables"]
[null,"N","%","N","%","N","%","N","%","N","%","N","N","%","N"]
["1511 - RLS d'Antoine-Labelle",0,0,2490,7.6968345412872452,540,1.6663569348943814,23710,73.440500526544014,5550,17.19630799727436,32290,2960,8.390318644837274,35240]
["    Notre-Dame-du-Laus",0,0,0,0,0,0,1560,100,0,0,1560,0,0,1560]
["    Notre-Dame-de-Pontmain",0,0,0,0,0,0,780,100,0,0,780,0,0,780]
["    Lac-du-Cerf",0,0,0,0,0,0,440,100,0,0,440,0,0,440]
["    Saint-Aimé-du-lac-des-îles",0,0,0,0,0,0,790,100,0,0,790,0,0,790]
["    Kiamika",0,0,0,0,0,0,760,100,0,0,760,0,0,760]
["    Nominingue",0,0,610,28.685072531586336,0,0,1520,71.314927468413671,0,0,2140,0,0,2140]
["    Rivière-Rouge",0,0,720,16.728366496992134,0,0,2360,54.673762147154093,1240,28.597871355853773,4320,0,0,4320]
["    La Macaza",0,0,0,0,0,0,0,0,440,100,440,710,61.826086956521742,1150]
["    L'Ascension",0,0,0,0,0,0,790,100,0,0,790,0,0,790]
["    Lac-Saguay",0,0,0,0,0,0,460,100,0,0,460,0,0,460]
["    Chute-Saint-Philippe",0,0,0,0,0,0,940,100,0,0,940,0,0,940]
["    Lac-des-Écorces",0,0,690,25.164594001463058,0,0,1600,58.37600585223116,450,16.459400146305782,2730,0,0,2730]
{"$rows_left_out":255}
{"sheet":"Liste","index":4,"n_rows":53,"n_cols":6,"rows_kept":53,"cut":false,"hidden":false,"merged":[]}
[null,null,null,"Matérielle et sociale"]
[null,null,null,"Matérielle"]
[null,null,null,"Sociale"]
[720,"MRC  Deux-Montagnes","Local"]
[730,"MRC Thérèse-De Blainville","Local"]
[740,"Mirabel","Local"]
[750,"MRC la Rivière-du-Nord","Local"]
[760,"MRC Argenteuil","Local"]
[770,"MRC Les Pays-d'en-Haut","Local"]
[780,"MRC Les Laurentides","Local"]
[790,"MRC Antoine-Labelle","Local"]
[]
[]
[]
[]
[]
[]
[]
[]
[]
{"$rows_left_out":34}
{"sheet":"Correspondance","index":5,"n_rows":91,"n_cols":35,"rows_kept":91,"cut":false,"hidden":false,"merged":[]}
["Id Territoire","Concanetation","Territoire","Type défavo","Plage Total","Plage en-tête","Plage Q5","Plage Q5 en-tête","Plage Q5 Territoire","PNG Carte","Nom carte","Endroit Copie Tableau","Endroit Copie en-tête","Endroit Copie Tableau Q5","Endroit Copie Q5 en-tête","Endroit Copie Tableau Territoire Q5","Texte carte","Texte tableau","Texte 2011","Endroit texte carte","Endroit texte tableau","Titre","Source","Endroit Source","Hauteur Ligne 4","Titre Q5","Source DSP","Endroit Source DSP","Note Pop sans indice","Endroit Note Pop sans indice","Lien vers Cartes 2011","Plage Tableau à copier","Plage Tableau Q5 à copier","Titre carte","Tableau Plus Défavo"]
[]
[]
[]
[]
[]
[]
[]
[]
[]
[]
[]
[]
[]
[]
[]
[]
[]
[]
[]
{"$rows_left_out":72}
{"sheet":"Entete","index":6,"n_rows":30,"n_cols":14,"rows_kept":30,"cut":false,"hidden":false,"merged":[[27,0,27,1],[28,0,28,1],[22,0,22,1],[22,4,22,5],[22,6,23,6],[22,7,23,8],[22,9,23,9],[23,0,23,1],[23,2,23,3],[23,4,23,5],[2,11,2,12],[11,0,11,1],[17,0,17,1],[1,0,2,1],[1,2,2,3],[1,4,2,5],[1,6,2,7],[1,8,2,9],[12,0,13,1],[18,0,18,1],[6,10,7,10],[6,11,7,12],[6,13,7,13],[7,0,7,1],[7,2,7,3],[7,4,7,5],[7,6,7,7],[7,8,7,9],[6,0,6,1],[6,8,6,9],[0,0,0,1],[0,2,0,3],[0,4,0,5],[0,6,0,7],[0,8,0,9]]}
["Profil 1",null,"Profil 2",null,"Profil 3",null,"Profil 4",null,"Profil 5"]
["Conditions matériellement \nET socialement \nplus favorables",null,"Conditions moyennes matériellement\nEt socialement",null,"Conditions socialement\nplus défavorables\n(pas matériellement)",null,"Conditions matériellement\nplus défavorables\n(pas socialement)",null,"Conditions matériellement\nET socialement\nplus défavorables"]
[null,null,null,null,null,null,null,null,null,null,"Population\navec indice","Population\nsans indice",null,"Population\ntotale"]
["N","%","N","%","N","%","N","%","N","%","N","N","%","N"]
[]
[]
["Conditions\nplus favorables",null,null,null,null,null,null,null,"Conditions\nplus défavorables",null,"Population avec indice","Population\nsans indice",null,"Population totale"]
["Quintile 1",null,"Quintile 2",null,"Quintile 3",null,"Quintile 4",null,"Quintile 5"]
["N","%","N","%","N","%","N","%","N","%","N","N","%","N"]
[]
[]
["Profil 5"]
["Conditions matériellement\nET socialement\nplus défavorables"]
[]
["N","%"]
[]
[]
["Conditions\nplus défavorables"]
["Quintile 5"]
["N","%"]
{"$rows_left_out":11}
{"sheet":"Formulaire","index":7,"n_rows":16,"n_cols":19,"rows_kept":16,"cut":false,"hidden":false,"merged":[[21,1,21,3],[0,12,3,12]]}
[null,null,null,null,null,null,null,null,null,null,null,null,"Mode d'emploi en capsule vidéo",null,null,null,null,null,"Version : 25 mars 2024"]
[]
[]
[]
[]
["  Panorama de la défavorisation comprend une gamme d’outils sur l’indice de défavorisation dans la région des Laurentides et ses territoires. On retrouve des outils qui servent à :"]
["·         localiser les populations les plus défavorisées "]
["·         quantifier l’importance de la défavorisation dans des secteurs"]
["·         caractériser le profil de défavorisation des populations."]
[]
[]
[]
[]
[]
[null,"  Avez-vous l'intérêt sur la population…",null,null,null,"  Choisissez le territoire désiré…",null,null,null,null,"  Voulez-vous observer la défavorisation "]
[null,null,null,null,null,null,null,null,null,null,"  selon sa dimension…"]

{"sheet":"Choix","index":8,"n_rows":34,"n_cols":4,"rows_kept":34,"cut":false,"hidden":false,"merged":[]}
[null,720,"Matérielle et sociale","Local"]
[]
[]
[null,{"$f":"B1&C1&D1","v":"720Matérielle et socialeLocal"}]
["Plage totale",{"$f":"VLOOKUP(B$4,Correspondance!B$2:AZ$100,4,FALSE)","v":"A7:O14"}]
["Plage Q5",{"$f":"VLOOKUP(B$4,Correspondance!B$2:AZ$100,6,FALSE)","v":"J7:K14"}]
["Plage en tête totale",{"$f":"VLOOKUP(B$4,Correspondance!B$2:AZ$100,5,FALSE)","v":"A1:N4"}]
["Plage en tête Q5",{"$f":"VLOOKUP(B$4,Correspondance!B$2:AZ$100,7,FALSE)","v":"A12:B15"}]
["Plage Q5 Territoire",{"$f":"VLOOKUP(B$4,Correspondance!B$2:AZ$100,8,FALSE)","v":"A7:A14"}]
["Carte",{"$f":"VLOOKUP(B$4,Correspondance!B$2:AZ$100,10,FALSE)","v":"MRC_DM_2016_Comb"}]
["Endroit Copie Tableau",{"$f":"VLOOKUP(B$4,Correspondance!B$2:AZ$100,11,FALSE)","v":"A6"}]
["Endroit Copie en-tête",{"$f":"VLOOKUP(B$4,Correspondance!B$2:AZ$100,12,FALSE)","v":"B2"}]
["Endroit Copie Tableau Q5",{"$f":"VLOOKUP(B$4,Correspondance!B$2:AZ$100,13,FALSE)","v":"B6"}]
["Endroit Copie Q5 en-tête",{"$f":"VLOOKUP(B$4,Correspondance!B$2:AZ$100,14,FALSE)","v":"B2"}]
["Endroit Copie Tableau Territoire Q5",{"$f":"VLOOKUP(B$4,Correspondance!B$2:AZ$100,15,FALSE)","v":"A6"}]
["Texte carte",{"$f":"VLOOKUP(B$4,Correspondance!B$2:AZ$100,16,FALSE)","v":"Dans la MRC de Deux-Montagnes, les secteurs ayant des conditions parmi les plus défavorables de la MRC à la fois sur le plan matériel et social (profil 5 – en violet) sont localisés à Pointe-Calumet et à Saint-Eustache. À Pointe-Calumet, près du tiers de la population habite dans ces secteurs.\n\nLes secteurs où les conditions sont parmi les plus défavorables de la MRC seulement sur le plan social (profil 3 – en bleu) se trouvent à Pointe-Calumet, la municipalité de Deux-Montagnes, Saint-Eustache et à Sainte-Marthe-sur-le-Lac. Plus du tiers de la population de la municipalité de Deux-Montagnes habite dans ces secteurs.\n\nOn retrouve des secteurs qui présentent les conditions parmi les plus défavorables de la MRC seulement sur le plan matériel (profil 4 – en orangé) dans toutes les municipalités du territoire. Plus de la moitié de la population de Saint-Placide et de Pointe-Calumet réside dans ces secteurs.\n\nMise à jour : janvier 2024"}]
["Texte tableau",{"$f":"VLOOKUP(B$4,Correspondance!B$2:AZ$100,17,FALSE)","v":"Dans la MRC de Deux-Montagnes, les secteurs ayant des conditions parmi les plus défavorables de la MRC à la fois sur le plan matériel et social (profil 5) sont localisés à Pointe-Calumet et à Saint-Eustache. À Pointe-Calumet, près du tiers de la population habite dans ces secteurs.\n\nLes secteurs où les conditions sont parmi les plus défavorables de la MRC seulement sur le plan social (profil 3) se trouvent à Pointe-Calumet, la municipalité de Deux-Montagnes, Saint-Eustache et à Sainte-Marthe-sur-le-Lac. Plus du tiers de la population de la municipalité de Deux-Montagnes habite dans ces secteurs.\n\nOn retrouve des secteurs qui présentent les conditions parmi les plus défavorables de la MRC seulement sur le plan matériel (profil 4) dans toutes les municipalités du territoire. Plus de la moitié de la population de Saint-Placide et de Pointe-Calumet réside dans ces secteurs.\n\nMise à jour : janvier 2024"}]
["Texte 2011",{"$f":"VLOOKUP(B$4,Correspondance!B$2:AZ$100,18,FALSE)","v":0}]
["Endroit texte carte",{"$f":"VLOOKUP(B$4,Correspondance!B$2:AZ$100,19,FALSE)","v":"J3:O40"}]
["Endroit texte tableau",{"$f":"VLOOKUP(B$4,Correspondance!B$2:AZ$100,20,FALSE)","v":"A19:K34"}]
{"$rows_left_out":14}